{"text_format":"1","workbook":"xlsx","n_sheets":5,"sheets":["Cover","Data upload","BASE","EBITDA calculation","Report"],"not_rendered":{"charts":0,"images":6,"macros":1,"external_links":0,"defined_names":5,"comments":0,"pivot_tables":0},"unopened":[],"bounds":{"document_bytes":16777216,"sheet_cells":100000,"rows_first":2000,"rows_last":500,"rows_between":2000,"halvings":0,"cell_chars":16384,"cell_head_chars":4096},"cells_cut":0,"cells_raw":0,"read":"whole","date_system":"1900"}

{"sheet":"Cover","index":0,"n_rows":42,"n_cols":3,"rows_kept":42,"cut":false,"hidden":false,"merged":[[39,1,40,2],[41,1,42,2],[24,1,34,2],[0,0,0,3],[10,1,10,2],[12,1,12,2],[6,0,6,3],[7,0,7,3],[16,1,16,2],[14,1,15,2]]}
[]
[]
[null,null,"Spanish Accounting and Business Administration Association"]
[]
[]
[]
["EBITDA (AECA definition(1))- Firm/sector of activity comparison (2014 - 2015)"]
["Standard format for preparation"]
[]
[]
[]
[]
[null,"-    Data specification"]
[]
[null,"-    EBITDA calculation\n     (AECA definition and  related ratios)"]
[]
[null,"-    Comparative Firm/Sector report"]
[]
[]
[]
[]
[]
[]
[]
[null,"Commission of Accounting Principles and Standards (AECA). Scope of the work.\n\nThe Commission of Accounting Principles and Standards has issued an opinion, OE no. 4/2016, in which it identifies the concepts of income and expenses that a firm should consider when calculating its Earnings Before Interest, Taxes, Depreciation and Amortization (EBITDA).\n\nWith the aim of facilitating the use of this definition and making the results between several firms comparable:\n1.    AECA has developed this tool, available to Spanish firms free of charge, in which it has opted for a simplified version of EBITDA (AECA definition).\n2.    The simplification allows for calculation from the annual financial statements deposited by firms in the Mercantile Registers, in an automated manner, when done using the officially deposited XBRL file.\n3.    The selected definition of EBITDA enables the comparison of firms with data on the sector/size in which they operate, using for this purpose the sample of Spanish firms submitted to the BACH database, which is public and free of charge.\n\nHowever, in order to enable firms to fully apply  OE no. 4/2016 should they wish to do so, this spreadsheet allows for the incorporation of other adjustments to non-recurring income and expenses, which will refine the calculation of the firm's EBITDA. However, such changes may not be made to the reference aggregated data (BACH) and their impact should therefore be analysed by interested users."]
[]
[]
[]
[]
[]
[]
[]
[]
[]
[]
[]
[]
[]
[]
[null,"(1) Harmonized definition of the Commission of Accounting Principles and Standards, compatible with the definition of the European Committee of Central Balance Sheet Data Offices in its BACH database."]
[]
[null,"© Copyright: AECA/XBRL España, 2016 Madrid. All rights reserved. Its use by firms and analysts is authorised. "]

{"sheet":"Data upload","index":1,"n_rows":203,"n_cols":22,"rows_kept":203,"cut":false,"hidden":false,"merged":[[3,1,3,7],[26,4,26,5],[21,4,21,5],[17,6,17,7],[26,6,26,7],[6,4,6,7],[7,4,7,7],[8,4,8,7],[17,4,17,5],[24,4,24,5],[9,4,9,7],[18,4,18,5],[15,6,15,7],[16,6,16,7],[18,6,18,7],[21,6,21,7],[56,1,56,8],[55,1,55,7],[19,6,19,7],[20,4,20,5],[19,4,19,5],[30,1,30,7],[53,1,53,7],[23,4,23,5],[54,1,54,7],[27,4,27,5],[27,6,27,7],[24,6,24,7],[23,6,23,7],[22,4,22,5],[22,6,22,7],[20,6,20,7],[15,4,15,5],[16,4,16,5],[15,2,15,3],[5,1,5,5],[11,4,11,5],[11,6,11,7],[14,6,14,7],[14,4,14,5],[12,4,12,5],[12,6,12,7],[13,4,13,5],[13,6,13,7]]}
[" "]
[]
[]
[null,"Upload of firm data"]
[]
[null,"Identification",null,null,null,null,null,1]
[null,"Name of firm"]
[null,"Tax identification number"]
[null,"NACE"]
[null,"YEAR",null,null,"N"]
[null,"Statement of profit or loss",null,null,null,null,null,"Amount (units)"]
[null,"Code","Item",null,{"$f":"IF(G12=\"N\",\"N-1\",E10-1)","v":"N-1"},null,{"$f":"+E10","v":"N"}]
[null,40100,"Net turnover (+)"]
[null,40800,"Depreciation and amortization of intangible and tangible fixed assets (-)"]
[null,40900,"Government grants of non-financial assets recognised as income during the year (+)"]
[null,41100,"Impairment and gain/loss on intangible and tangible fixed assets (+/-)"]
[null,41200,"Negative goodwill resulting from business combinations (1) (+)"]
[null,41300,"Other gains/losses (+/-)"]
[null,41400,"Financial income (+)"]
[null,41500,"Financial expenses (-)"]
[null,41600,"Gain/loss in changes in fair value of financial instruments (+/-)"]
[null,41700,"Exchange differences (+/-)"]
[null,41800,"Impairment and gain/loss on financial instruments (+/-)"]
[null,42100,"Other financial income/expenses (+/-)"]
[null,41900,"Tax on profit (+/-)"]
[]
[null,42000,"Profit/loss from discontinued operations net of tax (1) (+/-)"]
[null,49500,"Net profit or loss for the year (+/-)"]
[]
[]
[null,{"$f":"CONCATENATE(\"Selection of comparative sector and size (BACH database \",BASE!B2,\" - \",BASE!B2+1,\")\")","v":"Selection of comparative sector and size (BACH database 2014 - 2015)"}]
[null,"Information from BACH database updated in January 2017"]
[null,"Selection of year"]
[]
[]
[null,"Selection of sector"]
[]
[]
[null,"Selection of size according to the amount of net turnover"]
[]
[null,null,null,null,null,"          Percentage (%)"]
[null,"Ratio","Name of Ratio",null,"Number of firms","Q1","Q2","Q3"]
[null,"Operating costs, earnings and profitability"]
[null,"R33/BACH",{"$f":"CONCATENATE(\"EBITDA / Net turnover (\",K90,\")\")","v":"EBITDA / Net turnover ()"},null,{"$f":"IF(ISERROR(INDIRECT(CONCATENATE(\"'BASE'!\",ADDRESS($L$90+$L$91+$L$92,25)))),\"\",IF(INDIRECT(CONCATENATE(\"'BASE'!\",ADDRESS($L$90+$L$91+$L$92,25)))=\"\",\"-\",INDIRECT(CONCATENATE(\"'BASE'!\",ADDRESS($L$90+$L$91+$L$92,25)))))","v":""},{"$f":"IF(ISERROR(INDIRECT(CONCATENATE(\"'BASE'!\",ADDRESS($L$90+$L$91+$L$92,26)))),\"\",IF(INDIRECT(CONCATENATE(\"'BASE'!\",ADDRESS($L$90+$L$91+$L$92,26)))=\"\",\"-\",INDIRECT(CONCATENATE(\"'BASE'!\",ADDRESS($L$90+$L$91+$L$92,26)))))","v":""},{"$f":"IF(ISERROR(INDIRECT(CONCATENATE(\"'BASE'!\",ADDRESS($L$90+$L$91+$L$92,27)))),\"\",IF(INDIRECT(CONCATENATE(\"'BASE'!\",ADDRESS($L$90+$L$91+$L$92,27)))=\"\",\"-\",INDIRECT(CONCATENATE(\"'BASE'!\",ADDRESS($L$90+$L$91+$L$92,27)))))","v":""},{"$f":"IF(ISERROR(INDIRECT(CONCATENATE(\"'BASE'!\",ADDRESS($L$90+$L$91+$L$92,28)))),\"\",IF(INDIRECT(CONCATENATE(\"'BASE'!\",ADDRESS($L$90+$L$91+$L$92,28)))=\"\",\"-\",INDIRECT(CONCATENATE(\"'BASE'!\",ADDRESS($L$90+$L$91+$L$92,28)))))","v":""}]
[null,"R33/BACH",{"$f":"CONCATENATE(\"EBITDA / Net turnover (\",IF(K90=\"\",\"\",K90-1),\")\")","v":"EBITDA / Net turnover ()"},null,{"$f":"IF(ISERROR(INDIRECT(CONCATENATE(\"'BASE'!\",ADDRESS($L$90+$L$91+$L$92+500,25)))),\"\",IF(INDIRECT(CONCATENATE(\"'BASE'!\",ADDRESS($L$90+$L$91+$L$92+500,25)))=\"\",\"-\",INDIRECT(CONCATENATE(\"'BASE'!\",ADDRESS($L$90+$L$91+$L$92+500,25)))))","v":""},{"$f":"IF(ISERROR(INDIRECT(CONCATENATE(\"'BASE'!\",ADDRESS($L$90+$L$91+$L$92+500,26)))),\"\",IF(INDIRECT(CONCATENATE(\"'BASE'!\",ADDRESS($L$90+$L$91+$L$92+500,26)))=\"\",\"-\",INDIRECT(CONCATENATE(\"'BASE'!\",ADDRESS($L$90+$L$91+$L$92+500,26)))))","v":""},{"$f":"IF(ISERROR(INDIRECT(CONCATENATE(\"'BASE'!\",ADDRESS($L$90+$L$91+$L$92+500,27)))),\"\",IF(INDIRECT(CONCATENATE(\"'BASE'!\",ADDRESS($L$90+$L$91+$L$92+500,27)))=\"\",\"-\",INDIRECT(CONCATENATE(\"'BASE'!\",ADDRESS($L$90+$L$91+$L$92+500,27)))))","v":""},{"$f":"IF(ISERROR(INDIRECT(CONCATENATE(\"'BASE'!\",ADDRESS($L$90+$L$91+$L$92+500,28)))),\"\",IF(INDIRECT(CONCATENATE(\"'BASE'!\",ADDRESS($L$90+$L$91+$L$92+500,28)))=\"\",\"-\",INDIRECT(CONCATENATE(\"'BASE'!\",ADDRESS($L$90+$L$91+$L$92+500,28)))))","v":""}]
[]
[null,"R22/BACH",{"$f":"CONCATENATE(\"EBITDA / Financial expenses (\",K90,\")\")","v":"EBITDA / Financial expenses ()"},null,{"$f":"IF(ISERROR(INDIRECT(CONCATENATE(\"'BASE'!\",ADDRESS($L$90+$L$91+$L$92,20)))),\"\",IF(INDIRECT(CONCATENATE(\"'BASE'!\",ADDRESS($L$90+$L$91+$L$92,20)))=\"\",\"-\",INDIRECT(CONCATENATE(\"'BASE'!\",ADDRESS($L$90+$L$91+$L$92,20)))))","v":""},{"$f":"IF(ISERROR(INDIRECT(CONCATENATE(\"'BASE'!\",ADDRESS($L$90+$L$91+$L$92,21)))),\"\",IF(INDIRECT(CONCATENATE(\"'BASE'!\",ADDRESS($L$90+$L$91+$L$92,21)))=\"\",\"-\",INDIRECT(CONCATENATE(\"'BASE'!\",ADDRESS($L$90+$L$91+$L$92,21)))))","v":""},{"$f":"IF(ISERROR(INDIRECT(CONCATENATE(\"'BASE'!\",ADDRESS($L$90+$L$91+$L$92,22)))),\"\",IF(INDIRECT(CONCATENATE(\"'BASE'!\",ADDRESS($L$90+$L$91+$L$92,22)))=\"\",\"-\",INDIRECT(CONCATENATE(\"'BASE'!\",ADDRESS($L$90+$L$91+$L$92,22)))))","v":""},{"$f":"IF(ISERROR(INDIRECT(CONCATENATE(\"'BASE'!\",ADDRESS($L$90+$L$91+$L$92,23)))),\"\",IF(INDIRECT(CONCATENATE(\"'BASE'!\",ADDRESS($L$90+$L$91+$L$92,23)))=\"\",\"-\",INDIRECT(CONCATENATE(\"'BASE'!\",ADDRESS($L$90+$L$91+$L$92,23)))))","v":""}]
[null,"R22/BACH",{"$f":"CONCATENATE(\"EBITDA / Financial expenses (\",IF(K90=\"\",\"\",K90-1),\")\")","v":"EBITDA / Financial expenses ()"},null,{"$f":"IF(ISERROR(INDIRECT(CONCATENATE(\"'BASE'!\",ADDRESS($L$90+$L$91+$L$92+500,20)))),\"\",IF(INDIRECT(CONCATENATE(\"'BASE'!\",ADDRESS($L$90+$L$91+$L$92+500,20)))=\"\",\"-\",INDIRECT(CONCATENATE(\"'BASE'!\",ADDRESS($L$90+$L$91+$L$92+500,20)))))","v":""},{"$f":"IF(ISERROR(INDIRECT(CONCATENATE(\"'BASE'!\",ADDRESS($L$90+$L$91+$L$92+500,21)))),\"\",IF(INDIRECT(CONCATENATE(\"'BASE'!\",ADDRESS($L$90+$L$91+$L$92+500,21)))=\"\",\"-\",INDIRECT(CONCATENATE(\"'BASE'!\",ADDRESS($L$90+$L$91+$L$92+500,21)))))","v":""},{"$f":"IF(ISERROR(INDIRECT(CONCATENATE(\"'BASE'!\",ADDRESS($L$90+$L$91+$L$92+500,22)))),\"\",IF(INDIRECT(CONCATENATE(\"'BASE'!\",ADDRESS($L$90+$L$91+$L$92+500,22)))=\"\",\"-\",INDIRECT(CONCATENATE(\"'BASE'!\",ADDRESS($L$90+$L$91+$L$92+500,22)))))","v":""},{"$f":"IF(ISERROR(INDIRECT(CONCATENATE(\"'BASE'!\",ADDRESS($L$90+$L$91+$L$92+500,23)))),\"\",IF(INDIRECT(CONCATENATE(\"'BASE'!\",ADDRESS($L$90+$L$91+$L$92+500,23)))=\"\",\"-\",INDIRECT(CONCATENATE(\"'BASE'!\",ADDRESS($L$90+$L$91+$L$92+500,23)))))","v":""}]
[]
[null,"R21/BACH",{"$f":"CONCATENATE(\"Financial income / EBITDA (\",K90,\")\")","v":"Financial income / EBITDA ()"},null,{"$f":"IF(ISERROR(INDIRECT(CONCATENATE(\"'BASE'!\",ADDRESS($L$90+$L$91+$L$92,15)))),\"\",IF(INDIRECT(CONCATENATE(\"'BASE'!\",ADDRESS($L$90+$L$91+$L$92,15)))=\"\",\"-\",INDIRECT(CONCATENATE(\"'BASE'!\",ADDRESS($L$90+$L$91+$L$92,15)))))","v":""},{"$f":"IF(ISERROR(INDIRECT(CONCATENATE(\"'BASE'!\",ADDRESS($L$90+$L$91+$L$92,16)))),\"\",IF(INDIRECT(CONCATENATE(\"'BASE'!\",ADDRESS($L$90+$L$91+$L$92,16)))=\"\",\"-\",INDIRECT(CONCATENATE(\"'BASE'!\",ADDRESS($L$90+$L$91+$L$92,16)))))","v":""},{"$f":"IF(ISERROR(INDIRECT(CONCATENATE(\"'BASE'!\",ADDRESS($L$90+$L$91+$L$92,17)))),\"\",IF(INDIRECT(CONCATENATE(\"'BASE'!\",ADDRESS($L$90+$L$91+$L$92,17)))=\"\",\"-\",INDIRECT(CONCATENATE(\"'BASE'!\",ADDRESS($L$90+$L$91+$L$92,17)))))","v":""},{"$f":"IF(ISERROR(INDIRECT(CONCATENATE(\"'BASE'!\",ADDRESS($L$90+$L$91+$L$92,18)))),\"\",IF(INDIRECT(CONCATENATE(\"'BASE'!\",ADDRESS($L$90+$L$91+$L$92,18)))=\"\",\"-\",INDIRECT(CONCATENATE(\"'BASE'!\",ADDRESS($L$90+$L$91+$L$92,18)))))","v":""}]
[null,"R21/BACH",{"$f":"CONCATENATE(\"Financial income / EBITDA (\",IF(K90=\"\",\"\",K90-1),\")\")","v":"Financial income / EBITDA ()"},null,{"$f":"IF(ISERROR(INDIRECT(CONCATENATE(\"'BASE'!\",ADDRESS($L$90+$L$91+$L$92+500,15)))),\"\",IF(INDIRECT(CONCATENATE(\"'BASE'!\",ADDRESS($L$90+$L$91+$L$92+500,15)))=\"\",\"-\",INDIRECT(CONCATENATE(\"'BASE'!\",ADDRESS($L$90+$L$91+$L$92+500,15)))))","v":""},{"$f":"IF(ISERROR(INDIRECT(CONCATENATE(\"'BASE'!\",ADDRESS($L$90+$L$91+$L$92+500,16)))),\"\",IF(INDIRECT(CONCATENATE(\"'BASE'!\",ADDRESS($L$90+$L$91+$L$92+500,16)))=\"\",\"-\",INDIRECT(CONCATENATE(\"'BASE'!\",ADDRESS($L$90+$L$91+$L$92+500,16)))))","v":""},{"$f":"IF(ISERROR(INDIRECT(CONCATENATE(\"'BASE'!\",ADDRESS($L$90+$L$91+$L$92+500,17)))),\"\",IF(INDIRECT(CONCATENATE(\"'BASE'!\",ADDRESS($L$90+$L$91+$L$92+500,17)))=\"\",\"-\",INDIRECT(CONCATENATE(\"'BASE'!\",ADDRESS($L$90+$L$91+$L$92+500,17)))))","v":""},{"$f":"IF(ISERROR(INDIRECT(CONCATENATE(\"'BASE'!\",ADDRESS($L$90+$L$91+$L$92+500,18)))),\"\",IF(INDIRECT(CONCATENATE(\"'BASE'!\",ADDRESS($L$90+$L$91+$L$92+500,18)))=\"\",\"-\",INDIRECT(CONCATENATE(\"'BASE'!\",ADDRESS($L$90+$L$91+$L$92+500,18)))))","v":""}]
[]
[]
[null,"Source: Spanish contribution to BACH database. Banco de España (Central Balance Sheet Data Office) / Registries in Spain (Mercantile registers - CPE) / European Committee of Central Balance Sheet Data Offices."]
[null,"Warning: The firms included in the BACH database do not form a statistical sample. The BACH database excludes firms without employment or activity. The redistribution of data is forbidden, even when it is intended to be free of charge. © Copyright Banco de España/Registros de España. 2005. Madrid. All rights reserved. "]
[null,"(1) Item to be used in separate financial statements only."]
[]
[]
[]
[]
[]
[]
[]
[]
[]
[]
[]
[]
[]
[]
[]
[]
[]
[]
[]
[]
[]
[]
[]
[]
[]
[]
[]
[]
[]
[]
[]
[]
[]
[null,null,null,null,null,null,null,null,null,null,"",{"$f":"INDIRECT(ADDRESS(MATCH(VALUE(K90),'Data upload'!V90:V91,0)+ROW(U89),COLUMN(U89)))","v":{"$error":"#VALUE!"}},null,0,"All sizes",null,null,null,null,null,0,2014]
[null,null,null,null,null,null,null,null,null,null,"",{"$f":"INDIRECT(ADDRESS(MATCH(K91,'Data upload'!L100:L203,0)+ROW(K99),COLUMN(K99)))","v":{"$error":"#N/A"}},null,2,{"$f":"IF(AND($L$91<>332,$L$91<>343,$L$91<>349,$L$91<>350,$L$91<>496),\"Large companies : turnover >= 50 M€\",\"\")","v":{"$error":"#N/A"}},null,null,null,null,null,1002,2015]
[null,null,null,null,null,null,null,null,null,null,"SMEs : turnover < 50 M€",{"$f":"IF(K92=\"\",0,INDIRECT(ADDRESS(MATCH(K92,O90:O94,0)+ROW(N89),COLUMN(N89))))","v":{"$error":"#N/A"}},null,1,{"$f":"IF(AND($L$91<>332,$L$91<>343,$L$91<>349,$L$91<>350,$L$91<>496),\"SMEs : turnover < 50 M€\",\"\")","v":{"$error":"#N/A"}}]
[null,null,null,null,null,null,null,null,null,null,null,null,null,4,{"$f":"IF(AND($L$91<>332,$L$91<>343,$L$91<>349,$L$91<>350,$L$91<>496),\"Medium-size companies : 10 M€ < turnover < 50 M€\",\"\")","v":{"$error":"#N/A"}}]
[null,null,null,null,null,null,null,null,null,null,null,null,null,3,{"$f":"IF(AND($L$91<>332,$L$91<>343,$L$91<>349,$L$91<>350,$L$91<>496),\"Small companies : turnover < 10 M€\",\"\")","v":{"$error":"#N/A"}}]
[]
[]
[]
[]
[]
[null,null,null,null,null,null,null,null,null,null,2,"A - AGRICULTURE, FORESTRY AND FISHING"]
[null,null,null,null,null,null,null,null,null,null,7,"A01 - Crop & animal prod., hunting & related service activities"]
[null,null,null,null,null,null,null,null,null,null,12,"A02 - Forestry and logging"]
[null,null,null,null,null,null,null,null,null,null,17,"A03 - Fishing and aquaculture"]
[null,null,null,null,null,null,null,null,null,null,22,"B - MINING AND QUARRYING"]
[null,null,null,null,null,null,null,null,null,null,27,"B05 - Mining of coal and lignite"]
[null,null,null,null,null,null,null,null,null,null,32,"B06 - Extraction of crude petroleum and natural gas"]
[null,null,null,null,null,null,null,null,null,null,37,"B07 - Mining of metal ores"]
[null,null,null,null,null,null,null,null,null,null,42,"B08 - Other mining and quarrying"]
[null,null,null,null,null,null,null,null,null,null,47,"B09 - Mining support service activities"]
[null,null,null,null,null,null,null,null,null,null,52,"C - MANUFACTURING"]
[null,null,null,null,null,null,null,null,null,null,57,"C10 - Manufacture of food products"]
[null,null,null,null,null,null,null,null,null,null,62,"C11 - Manufacture of beverages"]
[null,null,null,null,null,null,null,null,null,null,67,"C12 - Manufacture of tobacco products"]
[null,null,null,null,null,null,null,null,null,null,72,"C13 - Manufacture of textiles"]
[null,null,null,null,null,null,null,null,null,null,77,"C14 - Manufacture of wearing apparel"]
[null,null,null,null,null,null,null,null,null,null,82,"C15 - Manufacture of leather and related products"]
[null,null,null,null,null,null,null,null,null,null,87,"C16 - Manuf.& prod. of wood & cork; articl.of straw,etc "]
[null,null,null,null,null,null,null,null,null,null,92,"C17 - Manufacture of paper and paper products"]
[null,null,null,null,null,null,null,null,null,null,97,"C18 - Printing and reproduction of recorded media"]
[null,null,null,null,null,null,null,null,null,null,102,"C19 - Manufacture of coke and refined petroleum products"]
[null,null,null,null,null,null,null,null,null,null,107,"C20 - Manufacture of chemicals and chemical products"]
[null,null,null,null,null,null,null,null,null,null,112,"C21 - Manuf. of basic pharmaceut. products & pharmaceut. preparat."]
[null,null,null,null,null,null,null,null,null,null,117,"C22 - Manufacture of rubber and plastic products"]
[null,null,null,null,null,null,null,null,null,null,122,"C23 - Manufacture of other non-metallic mineral products"]
[null,null,null,null,null,null,null,null,null,null,127,"C24 - Manufacture of basic metals"]
[null,null,null,null,null,null,null,null,null,null,132,"C25 - Manuf. of fabric. metal prod. except machinery & equipment"]
[null,null,null,null,null,null,null,null,null,null,137,"C26 - Manufacture of computer, electronic and optical products"]
[null,null,null,null,null,null,null,null,null,null,142,"C27 - Manufacture of electrical equipment"]
[null,null,null,null,null,null,null,null,null,null,147,"C28 - Manufacture of machinery and equipment n.e.c."]
[null,null,null,null,null,null,null,null,null,null,152,"C29 - Manufacture of motor vehicles, trailers and semi-trailers"]
[null,null,null,null,null,null,null,null,null,null,157,"C30 - Manufacture of other transport equipment"]
[null,null,null,null,null,null,null,null,null,null,162,"C31 - Manufacture of furniture"]
[null,null,null,null,null,null,null,null,null,null,167,"C32 - Other manufacturing"]
[null,null,null,null,null,null,null,null,null,null,172,"C33 - Repair and installation of machinery and equipment"]
[null,null,null,null,null,null,null,null,null,null,177,"D - ELECTRICITY, GAS, STEAM AND AIR CONDITIONING SUPPLY"]
[null,null,null,null,null,null,null,null,null,null,182,"D35 - Electricity, gas, steam and air conditioning supply"]
[null,null,null,null,null,null,null,null,null,null,187,"E - WATER SUPPLY; SEWERAGE, WASTE MANAGEMENT & REMEDIATION ACT."]
[null,null,null,null,null,null,null,null,null,null,192,"E36 - Water collection, treatment and supply"]
[null,null,null,null,null,null,null,null,null,null,197,"E37 - Sewerage"]
[null,null,null,null,null,null,null,null,null,null,202,"E38 - Waste collect. treatment & disposal act.; materials recovery"]
[null,null,null,null,null,null,null,null,null,null,207,"E39 - Remediation activities and other waste management services"]
[null,null,null,null,null,null,null,null,null,null,212,"F - CONSTRUCTION"]
[null,null,null,null,null,null,null,null,null,null,217,"F41 - Construction of buildings"]
[null,null,null,null,null,null,null,null,null,null,222,"F42 - Civil engineering"]
[null,null,null,null,null,null,null,null,null,null,227,"F43 - Specialised construction activities"]
[null,null,null,null,null,null,null,null,null,null,232,"G - WHOLESALE & RETAIL TRADE; REPAIR OF MOTOR VEHIC. & MOTORCYC."]
[null,null,null,null,null,null,null,null,null,null,237,"G45 - Wholesale & retail trade; repair of motor vehic. & motorcyc."]
[null,null,null,null,null,null,null,null,null,null,242,"G46 - Wholesale trade, except of motor vehicles and motorcycles"]
[null,null,null,null,null,null,null,null,null,null,247,"G47 - Retail trade, except of motor vehicles and motorcycles"]
[null,null,null,null,null,null,null,null,null,null,252,"H - TRANSPORTATION AND STORAGE"]
[null,null,null,null,null,null,null,null,null,null,257,"H49 - Land transport and transport via pipelines"]
[null,null,null,null,null,null,null,null,null,null,262,"H50 - Water transport"]
[null,null,null,null,null,null,null,null,null,null,267,"H51 - Air transport"]
[null,null,null,null,null,null,null,null,null,null,272,"H52 - Warehousing and support activities for transportation"]
[null,null,null,null,null,null,null,null,null,null,277,"H53 - Postal and courier activities"]
[null,null,null,null,null,null,null,null,null,null,282,"I - ACCOMMODATION AND FOOD SERVICE ACTIVITIES"]
[null,null,null,null,null,null,null,null,null,null,287,"I55 - Accommodation"]
[null,null,null,null,null,null,null,null,null,null,292,"I56 - Food and beverage service activities"]
[null,null,null,null,null,null,null,null,null,null,297,"J - INFORMATION AND COMMUNICATION"]
[null,null,null,null,null,null,null,null,null,null,302,"J58 - Publishing activities"]
[null,null,null,null,null,null,null,null,null,null,307,"J59 - Motion pict., video & TV progr. prod., sound record. & music"]
[null,null,null,null,null,null,null,null,null,null,312,"J60 - Programming and broadcasting activities"]
[null,null,null,null,null,null,null,null,null,null,317,"J61 - Telecommunications"]
[null,null,null,null,null,null,null,null,null,null,322,"J62 - Computer programming, consultancy and related activities"]
[null,null,null,null,null,null,null,null,null,null,327,"J63 - Information service activities"]
[null,null,null,null,null,null,null,null,null,null,332,"K642 - Activities of holding companies"]
[null,null,null,null,null,null,null,null,null,null,333,"L - REAL ESTATE ACTIVITIES"]
[null,null,null,null,null,null,null,null,null,null,338,"L68 - Real estate activities"]
[null,null,null,null,null,null,null,null,null,null,343,"M - PROFESSIONAL, SCIENTIFIC AND TECHNICAL ACTIVITIES"]
[null,null,null,null,null,null,null,null,null,null,344,"M69 - Legal and accounting activities"]
[null,null,null,null,null,null,null,null,null,null,349,"M70 - Activities of head offices; management consultancy activit."]
[null,null,null,null,null,null,null,null,null,null,350,"M701 - Activities of head offices"]
[null,null,null,null,null,null,null,null,null,null,351,"M702 - Management consultancy services"]
[null,null,null,null,null,null,null,null,null,null,356,"M71 - Architect. & engineer. activ.; technical testing & analysis"]
[null,null,null,null,null,null,null,null,null,null,361,"M72 - Scientific research and development"]
[null,null,null,null,null,null,null,null,null,null,366,"M73 - Advertising and market research"]
[null,null,null,null,null,null,null,null,null,null,371,"M74 - Other professional, scientific and technical activities"]
[null,null,null,null,null,null,null,null,null,null,376,"M75 - Veterinary activities"]
[null,null,null,null,null,null,null,null,null,null,381,"Mc - PROFESSIONAL, SCIENTIFIC AND TECHNICAL ACTIVITIES (without M701)"]
[null,null,null,null,null,null,null,null,null,null,386,"N - ADMINISTRATIVE AND SUPPORT SERVICE ACTIVITIES"]
[null,null,null,null,null,null,null,null,null,null,391,"N77 - Rental and leasing activities"]
[null,null,null,null,null,null,null,null,null,null,396,"N78 - Employment activities"]
[null,null,null,null,null,null,null,null,null,null,401,"N79 - Travel agency tour operator & oth. reserv. serv. & rel. act."]
[null,null,null,null,null,null,null,null,null,null,406,"N80 - Security and investigation activities"]
[null,null,null,null,null,null,null,null,null,null,411,"N81 - Services to buildings and landscape activities"]
[null,null,null,null,null,null,null,null,null,null,416,"N82 - Office admin., office support & other business support act."]
[null,null,null,null,null,null,null,null,null,null,421,"P - EDUCATION"]
[null,null,null,null,null,null,null,null,null,null,426,"P85 - Education"]
[null,null,null,null,null,null,null,null,null,null,431,"Q - HUMAN HEALTH AND SOCIAL WORK ACTIVITIES"]
[null,null,null,null,null,null,null,null,null,null,436,"Q86 - Human health activities"]
[null,null,null,null,null,null,null,null,null,null,441,"Q87 - Residential care activities"]
[null,null,null,null,null,null,null,null,null,null,446,"Q88 - Social work activities without accommodation"]
[null,null,null,null,null,null,null,null,null,null,451,"R - ARTS, ENTERTAINMENT AND RECREATION"]
[null,null,null,null,null,null,null,null,null,null,456,"R90 - Creative, arts and entertainment activities"]
[null,null,null,null,null,null,null,null,null,null,461,"R91 - Libraries, archives, museums and other cultural activities"]
[null,null,null,null,null,null,null,null,null,null,466,"R92 - Gambling and betting activities"]
[null,null,null,null,null,null,null,null,null,null,471,"R93 - Sports activities and amusement and recreation activities"]
[null,null,null,null,null,null,null,null,null,null,476,"S - OTHER SERVICE ACTIVITIES"]
[null,null,null,null,null,null,null,null,null,null,481,"S94 - Activities of membership organisations"]
[null,null,null,null,null,null,null,null,null,null,486,"S95 - Repair of computers and personal and household goods"]
[null,null,null,null,null,null,null,null,null,null,491,"S96 - Other personal service activities"]
[null,null,null,null,null,null,null,null,null,null,496,"Z0 - TOTAL NACE (without K642)"]
[null,null,null,null,null,null,null,null,null,null,497,"Zc - TOTAL NACE (without K642 and M701)"]

{"sheet":"BASE","index":2,"n_rows":2003,"n_cols":28,"rows_kept":2003,"cut":false,"hidden":true,"merged":[]}
["country","year","sector","size","sample","coverage_firms","coverage_turnover","coverage_employees","total_assets","turnover","gross_value_added","nb_firms","employees","r21_wm","r21_nbq","r21_q1","r21_q2","r21_q3","r22_wm","r22_nbq","r22_q1","r22_q2","r22_q3","r33_wm","r33_nbq","r33_q1","r33_q2","r33_q3"]
["ES",2014,"A",0,1,null,null,null,19078262,10319638,2493319,14068,80920,14.8,10660,0,0.02,0.68,586.95000000000005,10894,93.6,525.54999999999995,2519.21,9.3699999999999992,13780,0.83,9.8699999999999992,26.79]
["ES",2014,"A",1,1,null,null,null,18104587,8554597,2319393,14054,77688,8.16,10647,0,0.02,0.68,528.71,10880,92.73,524.25,2522.4499999999998,9.6,13766,0.82,9.9,26.8]
["ES",2014,"A",2,1,null,null,null,973675,1765041,173925,14,3232,52.28,13,0.16,2.5499999999999998,4.75,1553.43,14,582.79999999999995,901.26,1587,8.24,14,3.85,5.34,10.72]
["ES",2014,"A","1a",1,null,null,null,15828826,6207335,1923554,13937,68200,7.75,10539,0,0.02,0.65,483.63,10768,89.47,521.55999999999995,2522.4499999999998,10.28,13649,0.75,9.98,26.96]
["ES",2014,"A","1b",1,null,null,null,2275760,2347261,395839,117,9488,9.6300000000000008,108,0.2,0.95,5.69,782.39,112,247.86,748.19,2503.67,7.82,117,1.85,4.34,10.4]
["ES",2014,"A01",0,1,null,null,null,16546491,9019691,2052165,12654,70001,15.18,9590,0,0.02,0.67,601.03,9796,98.21,526.08000000000004,2556.9,9.41,12398,0.84,10.19,28.43]
["ES",2014,"A01",1,1,null,null,null,15803622,7383895,1906508,12642,67087,7.82,9578,0,0.02,0.67,532.07000000000005,9784,98.11,525.16,2557.16,9.64,12386,0.84,10.199999999999999,28.44]
["ES",2014,"A01",2,1,null,null,null,742869,1635795,145657,12,2914,53.55,12,0.12,2.66,5.36,1848.71,12,636.62,1126.52,1781.95,8.36,12,4.0199999999999996,5.34,9.34]
["ES",2014,"A01","1a",1,null,null,null,14381899,5337233,1577809,12541,58785,8.06,9484,0,0.02,0.65,472.45,9687,93.15,522.88,2556.9499999999998,10.39,12285,0.75,10.3,28.63]
["ES",2014,"A01","1b",1,null,null,null,1421722,2046662,328698,101,8302,6.98,94,0.12,0.66,4.49,958.2,97,250.44,774.84,2579.4899999999998,7.69,101,1.84,4.0599999999999996,9.76]
["ES",2014,"A02",0,1,null,null,null,1049826,439346,142018,771,4733,13.85,553,0,0,0.47,395.13,573,-73.53,468.82,2013.72,7.41,752,-1.33,6.02,16.62]
["ES",2014,"A02",1,1,null,null,null,1049826,439346,142018,771,4733,13.85,553,0,0,0.47,395.13,573,-73.53,468.82,2013.72,7.41,752,-1.33,6.02,16.62]
["ES",2014,"A02",2,1,null,null,null,null,null,null,0,null,null,0,null,null,null,null,0,null,null,null,null,0]
["ES",2014,"A02","1a",1,null,null,null,637095,342344,116223,766,4143,7.6,548,0,0,0.41,503.81,569,-76.709999999999994,468.82,1992.28,6.8,747,-1.47,6.01,16.64]
["ES",2014,"A02","1b",1,null,null,null,null,null,null,5,null,null,5,null,null,null,null,4,null,null,null,null,5]
["ES",2014,"A03",0,1,null,null,null,1481944,860600,299134,643,6186,11.44,517,0,0.01,1.5,560.91999999999996,525,129.51,624.94000000000005,2321.69,9.94,630,2.17,9.9600000000000009,18]
["ES",2014,"A03",1,1,null,null,null,1251138,731354,270866,641,5868,9.19,516,0,0.01,1.46,579.16,523,131.12,624.94000000000005,2330.34,10.52,628,2.21,9.9600000000000009,18.02]
["ES",2014,"A03",2,1,null,null,null,null,null,null,2,null,null,1,null,null,null,null,2,null,null,null,null,2]
["ES",2014,"A03","1a",1,null,null,null,809831,527757,229520,630,5272,5.0199999999999996,507,0,0.01,1.35,607.54,512,128.05000000000001,620.05999999999995,2326.02,11.36,617,2.15,9.9600000000000009,18.03]
["ES",2014,"A03","1b",1,null,null,null,441306,203597,41346,11,596,23.93,9,null,null,null,497.2,11,null,null,null,8.35,11]
["ES",2014,"B",0,1,48.41,null,57.66,7702645,2025057,711446,1036,11845,43.33,661,0,0.12,3.98,1190.4100000000001,858,-335.72,293.77999999999997,1621.16,18.16,1010,-9.66,5.79,15.46]
["ES",2014,"B",1,1,null,null,null,3278141,1228877,376228,1030,8220,36,657,0,0.11,3.87,603.25,852,-326.72000000000003,293.02999999999997,1602.51,11.23,1004,-9.73,5.78,15.4]
["ES",2014,"B",2,1,null,null,null,4424504,796180,335218,6,3625,null,4,null,null,null,2866.28,6,null,1281.8800000000001,null,28.86,6,null,15.13]
["ES",2014,"B","1a",1,null,null,null,2164118,799610,267920,1010,6892,23.35,640,0,0.1,3.74,407.73,834,-348.51,269.95999999999998,1577.18,8.14,984,-9.9,5.67,15.42]
["ES",2014,"B","1b",1,null,null,null,1114022,429266,108307,20,1328,47.39,17,null,null,null,1056.6099999999999,18,null,null,null,17.02,20]
["ES",2014,"B05",0,1,31.03,null,51.75,727772,231812,56651,27,2384,-31.03,19,0,0.22,30.78,-950.23,21,-2.76,301.45,2126.37,-19.920000000000002,27,-0.05,6.69,18.850000000000001]
["ES",2014,"B05",1,1,null,null,null,228957,72797,31360,25,377,14.72,18,null,null,null,2515.36,19,null,null,null,13.85,25]
["ES",2014,"B05",2,1,null,null,null,null,null,null,2,null,null,1,null,null,null,null,2,null,null,null,null,2]
["ES",2014,"B05","1a",1,null,null,null,45150,25265,10292,23,195,55.44,16,null,null,null,1451.16,18,null,null,null,18.600000000000001,23]
["ES",2014,"B05","1b",1,null,null,null,null,null,null,2,null,null,2,null,null,null,null,1,null,null,null,null,2]
["ES",2014,"B06",0,1,63.16,null,34.770000000000003,859224,151733,129885,12,129,42.78,9,null,0,null,55952.41,9,null,202.4,null,140.31,9,null,15.06]
["ES",2014,"B06",1,1,null,null,null,29045,4156,3975,11,80,57.92,8,null,null,null,225.69,8,null,null,null,18.54,8]
["ES",2014,"B06",2,1,null,null,null,null,null,null,1,null,null,1,null,null,null,null,1,null,null,null,null,1]
["ES",2014,"B06","1a",1,null,null,null,29045,4156,3975,11,80,57.92,8,null,null,null,225.69,8,null,null,null,18.54,8]
["ES",2014,"B06","1b",1,null,null,null,null,null,null,0,null,null,0,null,null,null,null,0,null,null,null,null,0]
["ES",2014,"B07",0,1,23.61,null,6.94,80439,43951,7801,17,104,8.8800000000000008,10,null,1.08,null,521.75,9,null,468.63,null,7.27,16,-392.24,3.77,10.91]
["ES",2014,"B07",1,1,null,null,null,80439,43951,7801,17,104,8.8800000000000008,10,null,null,null,521.75,9,null,null,null,7.27,16]
["ES",2014,"B07",2,1,null,null,null,null,null,null,0,null,null,0,null,null,null,null,0,null,null,null,null,0]
["ES",2014,"B07","1a",1,null,null,null,28223,7589,1770,15,33,7.13,8,null,null,null,537.76,7,null,null,null,10.26,14]
["ES",2014,"B07","1b",1,null,null,null,null,null,null,2,null,null,2,null,null,null,null,2,null,null,null,null,2]
["ES",2014,"B08",0,1,49.11,null,62.74,3639548,1468222,482684,942,8685,23.78,595,0,0.13,3.97,848.72,794,-348.51,287.69,1490.55,14.26,922,-10.32,5.73,15.02]
["ES",2014,"B08",1,1,null,null,null,2812371,1067353,333450,940,7429,34.49,593,0,0.12,3.96,604.62,792,-351.01,284.35000000000002,1488.04,11.98,920,-10.41,5.73,14.92]
["ES",2014,"B08",2,1,null,null,null,null,null,null,2,null,null,2,null,null,null,null,2,null,null,null,null,2]
["ES",2014,"B08","1a",1,null,null,null,2021686,730774,242943,925,6354,21.23,580,0,0.11,3.89,382.3,778,-381.17,267.24,1483.16,7.77,905,-10.82,5.63,14.88]
["ES",2014,"B08","1b",1,null,null,null,790684,336578,90506,15,1075,45.09,13,null,null,null,1129.42,14,null,null,null,21.12,15]
["ES",2014,"B09",0,1,100,null,100,2395660,129337,34423,38,543,-35.799999999999997,28,0,0,0.36,-3010.31,25,65.87,825.77,4088.01,-8.75,36,1.3,8.09,23.16]
["ES",2014,"B09",1,1,null,null,null,127327,40618,-359,37,230,-93.71,28,0,0,0.36,-1011.34,24,85.18,1054.3,4443.75,-9.26,35,1.75,8.14,24.65]
["ES",2014,"B09",2,1,null,null,null,null,null,null,1,null,null,0,null,null,null,null,1,null,null,null,null,1]
["ES",2014,"B09","1a",1,null,null,null,40012,31824,8938,36,230,3.51,28,0,0,0.36,701.24,23,138.37,1282.8399999999999,4799.49,6.56,34,1.95,8.15,26.15]
["ES",2014,"B09","1b",1,null,null,null,null,null,null,1,null,null,0,null,null,null,null,1,null,null,null,null,1]
["ES",2014,"C",0,1,50.21,null,60.89,275366999,296770494,56623297,52796,951322,18,39554,0,0.02,0.99,783.77,44091,65.25,418.26,1854.83,7.56,52264,0.15,4.59,10.17]
["ES",2014,"C",1,1,null,null,null,85390416,79879629,23713596,52175,554540,7.17,38973,0,0.01,0.91,679.88,43503,58.33,411.46,1810.97,7.9,51643,7.0000000000000007E-2,4.55,10.119999999999999]
["ES",2014,"C",2,1,null,null,null,189976584,216890865,32909700,621,396782,22.31,581,0.47,2.5499999999999998,11.22,834.37,588,488.5,1397.97,5353.47,7.45,621,4.22,8.1999999999999993,13.64]
["ES",2014,"C","1a",1,null,null,null,49878693,43667275,14426179,50506,395470,5.72,37394,0,0.01,0.75,525.63,41914,35.840000000000003,394.07,1732.64,6.69,49974,-0.18,4.43,9.98]
["ES",2014,"C","1b",1,null,null,null,35511795,36212353,9287368,1669,159070,8.42,1579,0.23,1.78,6.83,909.52,1589,373.21,1033.21,4093.11,9.3699999999999992,1669,4.21,7.96,12.95]
["ES",2014,"C10",0,1,47.61,null,55.17,32328539,39257223,7283941,6684,149435,9.26,5361,0,0.01,0.71,676.28,5609,157.80000000000001,530.59,2151.88,7.49,6617,1.08,4.42,8.82]
["ES",2014,"C10",1,1,null,null,null,12909386,14823595,3217811,6553,86117,5.4,5235,0,0.01,0.64,692.83,5483,153.84,524.79,2123.36,7,6486,1.02,4.37,8.81]
["ES",2014,"C10",2,1,null,null,null,19419153,24433628,4066130,131,63318,11.38,126,0.4,1.92,8.3000000000000007,667.72,126,429.97,965.2,2933.5,7.79,131,3.88,6.29,9.5500000000000007]
["ES",2014,"C10","1a",1,null,null,null,6550942,6776539,1744380,6189,57328,3.93,4886,0,0,0.45,561.05999999999995,5129,138.72,506.07,2052.25,6.2,6122,0.82,4.28,8.67]
["ES",2014,"C10","1b",1,null,null,null,6358443,8047055,1473430,364,28789,6.41,349,0.12,1.1299999999999999,4.72,824.29,354,324.41000000000003,803.22,3288.16,7.69,364,2.99,6.12,10.92]
["ES",2014,"C11",0,1,45.05,null,52.11,13542459,9920988,2479745,1682,23300,14.44,1238,0,0.02,0.66,1733.7,1412,8.41,370.12,1551.89,14.41,1675,-1.03,8.0399999999999991,17.57]
["ES",2014,"C11",1,1,null,null,null,5030081,2451587,629568,1659,11006,11.15,1216,0,0.02,0.57999999999999996,740.09,1393,-4.21,355.72,1448.63,12.5,1652,-1.17,7.97,17.46]
["ES",2014,"C11",2,1,null,null,null,8512378,7469401,1850177,23,12294,15.33,22,0.43,2.7,7.24,2734.85,19,1340.08,2408.56,14967.19,15.04,23,8.9499999999999993,12.72,20.88]
["ES",2014,"C11","1a",1,null,null,null,3264520,1331034,379291,1602,8041,5.12,1163,0,0.01,0.48,508.67,1338,-18.7,339.12,1373.55,11.27,1595,-1.84,7.79,17.53]
["ES",2014,"C11","1b",1,null,null,null,1765561,1120552,250277,57,2965,16.95,53,0.28000000000000003,1.32,5.13,1314.17,55,575.01,1416.73,5510.87,13.95,57,6.08,11.84,17.100000000000001]
["ES",2014,"C12",0,1,100,null,100,4789699,978801,464533,14,2406,48.72,11,null,0.28999999999999998,null,508.42,11,null,572.53,null,64.349999999999994,14,3.15,4.3499999999999996,17.829999999999998]
["ES",2014,"C12",1,1,null,null,null,14268,12270,4848,10,153,7.19,7,null,null,null,325.87,9,null,null,null,3.81,10]
["ES",2014,"C12",2,1,null,null,null,null,null,null,4,null,null,4,null,null,null,null,2,null,null,null,null,4]
["ES",2014,"C12","1a",1,null,null,null,14268,12270,4848,10,153,7.19,7,null,null,null,325.87,9,null,null,null,3.81,10]
["ES",2014,"C12","1b",1,null,null,null,null,null,null,0,null,null,0,null,null,null,null,0,null,null,null,null,0]
["ES",2014,"C13",0,1,55.87,null,72.650000000000006,3073955,3211099,847885,1817,22779,7.39,1430,0,0.04,1.99,707.99,1525,133.33000000000001,431.03,1716.88,7.57,1800,0.99,4.57,9.34]
["ES",2014,"C13",1,1,null,null,null,2711842,2856105,767235,1813,21694,5.81,1426,0,0.04,1.93,630.4,1521,131.97,430.07,1712.54,6.84,1796,0.98,4.5599999999999996,9.3000000000000007]
["ES",2014,"C13",2,1,null,null,null,null,null,null,4,null,null,4,null,null,null,null,4,null,null,null,null,4]
["ES",2014,"C13","1a",1,null,null,null,1831959,1791003,509526,1765,15610,7.71,1379,0,0.03,1.7,508.35,1473,123.6,420.8,1620.05,6.09,1748,0.92,4.4800000000000004,9.2799999999999994]
["ES",2014,"C13","1b",1,null,null,null,879882,1065102,257709,48,6084,3.42,47,0.37,2.78,8.19,905.22,48,371.97,970.16,4153.03,8.1,48,5.14,6.98,10.54]
["ES",2014,"C14",0,1,38.979999999999997,null,60.1,2086878,2762587,649687,1534,19355,7.86,1017,0,0,1.63,686.59,1164,-200.83,228.42,1011.41,5.35,1512,-5.1100000000000003,3,7.96]
["ES",2014,"C14",1,1,null,null,null,1316180,1367648,380028,1520,13553,10.79,1008,0,0,1.64,383.82,1151,-197.36,226.75,989.06,4.78,1498,-5.34,3.01,7.98]
["ES",2014,"C14",2,1,null,null,null,770697,1394939,269659,14,5802,5.59,9,null,0.61,null,1838.27,13,-1519.11,2394.0700000000002,20450,5.91,14,-0.76,0.86,4.49]
["ES",2014,"C14","1a",1,null,null,null,1001741,965141,275093,1502,11011,17.91,990,0,0,1.49,263.86,1133,-224.06,221.86,955.86,3.56,1480,-5.82,2.97,7.9]
["ES",2014,"C14","1b",1,null,null,null,314438,402507,104934,18,2542,2.91,18,0.78,2.25,5.32,772.66,18,355.84,949.74,2427.86,7.71,18,4.59,7.54,9.77]
["ES",2014,"C15",0,1,46.91,null,57.87,1434661,2245133,578024,1542,20201,6.32,1290,0,0.03,1.2,704.69,1246,156.63,431.84,2297.52,5.65,1518,1.1599999999999999,3.39,6.87]
["ES",2014,"C15",1,1,null,null,null,1394597,2137449,529302,1541,19263,4.3499999999999996,1289,0,0.03,1.19,586.97,1245,156.58000000000001,431.68,2293.81,4.9400000000000004,1517,1.1599999999999999,3.39,6.86]
["ES",2014,"C15",2,1,null,null,null,null,null,null,1,null,null,1,null,null,null,null,1,null,null,null,null,1]
["ES",2014,"C15","1a",1,null,null,null,1048741,1656264,433688,1519,17290,4.25,1268,0,0.03,1.1499999999999999,452.87,1226,154.44999999999999,430.94,2243.96,4.1500000000000004,1495,1.1399999999999999,3.36,6.83]
["ES",2014,"C15","1b",1,null,null,null,345855,481184,95613,22,1973,4.76,21,0.31,1.17,5.13,1304.94,19,316.25,753.98,3213.91,7.71,22,2.87,5.74,9.41]
["ES",2014,"C16",0,1,51.88,null,59.98,3725483,3094338,789686,2847,22263,21.68,1921,0,0.01,0.61,427.35,2375,-239.63,273.55,1166.67,6.41,2814,-4.76,3.74,8.2799999999999994]
["ES",2014,"C16",1,1,null,null,null,3007281,2351648,634632,2844,19518,23.67,1918,0,0.01,0.61,332.22,2372,-240.49,272.95,1165.55,5.64,2811,-4.83,3.73,8.2799999999999994]
["ES",2014,"C16",2,1,null,null,null,null,null,null,3,null,null,3,null,null,null,null,3,null,null,null,null,3]
["ES",2014,"C16","1a",1,null,null,null,2328747,2013511,561679,2826,17811,5.76,1901,0,0.01,0.57999999999999996,327.56,2355,-248.37,270.24,1161.77,4.83,2793,-5.05,3.71,8.2799999999999994]
["ES",2014,"C16","1b",1,null,null,null,678534,338136,72952,18,1707,72.89,17,1.75,5.83,14.63,346.06,17,378.92,696.74,1946.67,10.48,18,4.04,6.06,8.19]
["ES",2014,"C17",0,1,50.44,null,58.82,9736195,7695528,1722235,738,23917,16.760000000000002,619,0,0.11,1.62,643.29999999999995,643,183.9,555.37,2460.8200000000002,10.06,729,2.17,5.51,9.59]
["ES",2014,"C17",1,1,null,null,null,2229137,2449437,640769,715,12808,2.86,598,0,0.09,1.41,900.85,621,177.99,529.57000000000005,2409.6799999999998,7.81,706,2.15,5.43,9.42]
["ES",2014,"C17",2,1,null,null,null,7507057,5246091,1081466,23,11109,21.35,21,0.45,3.18,10.25,588.35,22,613.89,2041.03,4027.48,11.12,23,4.99,8.8800000000000008,13.37]
["ES",2014,"C17","1a",1,null,null,null,866080,944147,260358,651,6922,3.35,539,0,0.04,1.04,545.80999999999995,558,162.82,467.16,1983.06,6.31,642,1.97,5.14,9.1300000000000008]
["ES",2014,"C17","1b",1,null,null,null,1363057,1505290,380410,64,5886,2.65,59,0.23,1.67,4.12,1276.6400000000001,63,588.28,1926.09,4887.46,8.75,64,3.98,8.33,11.21]
["ES",2014,"C18",0,1,48.13,null,70.650000000000006,4231769,3636240,1338039,4116,30501,5.74,3062,0,0,0.36,725.73,3416,69.37,420.24,1735.05,9.2799999999999994,4086,-0.23,5.68,11.91]
["ES",2014,"C18",1,1,null,null,null,3694127,3187218,1170671,4112,28256,6.14,3058,0,0,0.36,612.75,3414,69.27,420.24,1734.05,8.7899999999999991,4082,-0.25,5.68,11.91]
["ES",2014,"C18",2,1,null,null,null,null,null,null,4,null,null,4,null,null,null,null,2,null,null,null,null,4]
["ES",2014,"C18","1a",1,null,null,null,2659108,2297688,867957,4060,22798,4.79,3011,0,0,0.31,577,3362,66.400000000000006,414.22,1724.66,8.4600000000000009,4030,-0.32,5.66,11.88]
["ES",2014,"C18","1b",1,null,null,null,1035019,889530,302713,52,5458,9.1999999999999993,47,0.17,1.44,3.21,712.76,52,342.81,690.14,1962.6,9.65,52,4.16,8.59,13.41]
["ES",2014,"C19",0,1,100,null,100,23294205,43543092,23014,18,8100,-308.94,12,0,0.03,1.23,-98.7,15,53.79,568.33000000000004,2071.9,-0.4,18,-0.84,3.62,15.97]
["ES",2014,"C19",1,1,null,null,null,91843,71836,22620,14,205,1.24,10,null,0.01,null,1712.09,11,null,1416.13,null,14.74,14,0.1,10.69,16.89]
["ES",2014,"C19",2,1,null,null,null,null,null,null,4,null,null,2,null,null,null,null,4,null,null,null,null,4]
["ES",2014,"C19","1a",1,null,null,null,12580,9400,1527,12,47,22,8,null,0,null,176.47,9,null,568.33000000000004,null,2.19,12,-2.54,6.42,17.54]
["ES",2014,"C19","1b",1,null,null,null,null,null,null,2,null,null,2,null,null,null,null,2,null,null,null,null,2]
["ES",2014,"C20",0,1,52.62,null,60.17,22824432,28415335,4262524,1657,48432,23.68,1374,0,0.21,2.54,1493.5,1413,181.46,637.38,3028.32,8.09,1636,2.16,6.07,10.97]
["ES",2014,"C20",1,1,null,null,null,5360977,5687735,1458915,1593,24484,5.65,1315,0,0.15,2.2000000000000002,1069.3,1354,178.35,609.26,2672.04,9.52,1572,2.11,5.94,10.9]
["ES",2014,"C20",2,1,null,null,null,17463454,22727599,2803609,64,23948,29.23,59,1,3.16,15.67,1701.58,59,1006.3,3800.42,13869.7,7.73,64,4.51,8.4,15.36]
["ES",2014,"C20","1a",1,null,null,null,2084455,1961721,558782,1432,12220,4.2300000000000004,1159,0,0.1,1.73,659.13,1205,150.28,520.79999999999995,2264.09,7.93,1411,1.76,5.48,10.58]
["ES",2014,"C20","1b",1,null,null,null,3276521,3726014,900133,161,12264,6.22,156,0.22,1.86,7.86,1427.08,149,684,1997.42,8281.94,10.36,161,5.64,9,13.99]
["ES",2014,"C21",0,1,57.71,null,71.680000000000007,13098225,9703899,3589825,202,28410,10.24,173,0.01,0.78,4.71,2334.1799999999998,152,397.54,1416.42,7754.33,22.12,194,4.43,12.15,20.7]
["ES",2014,"C21",1,1,null,null,null,1524855,1225874,505623,161,6772,4.6100000000000003,133,0,0.27,2.1800000000000002,1484.84,114,249.17,1005.56,6983.33,16.29,153,3.13,11.67,20]
["ES",2014,"C21",2,1,null,null,null,11573370,8478025,3084202,41,21638,10.82,40,1.42,4.71,13.57,2479.71,38,1088.03,2869.01,12076.05,22.96,41,9.2100000000000009,14.15,22.04]
["ES",2014,"C21","1a",1,null,null,null,275808,198223,84881,121,1396,3.89,94,0,0.1,0.91,1339.74,82,190.13,669.45,6175.51,16.11,113,1.57,8.6199999999999992,20]
["ES",2014,"C21","1b",1,null,null,null,1249046,1027650,420741,40,5376,4.75,39,0.13,1.82,6.64,1516.21,32,841.19,1548.71,7807.76,16.329999999999998,40,10.95,14.58,18.3]
["ES",2014,"C22",0,1,50.1,null,57.66,8833578,10832367,3103061,1956,48982,6.76,1637,0,0.05,1.08,1351.05,1730,193.28,548.27,2244.31,11.61,1937,2.57,6.33,12.04]
["ES",2014,"C22",1,1,null,null,null,4784773,5395930,1511204,1928,30923,5.62,1609,0,0.05,1.02,873.71,1702,189.54,537.88,2205.34,9.23,1909,2.5099999999999998,6.3,11.97]
["ES",2014,"C22",2,1,null,null,null,4048805,5436436,1591856,28,18059,7.51,28,0.34,1.3,3.57,2105.38,28,994,1686.78,5659.73,13.97,28,7.68,10.37,15.91]
["ES",2014,"C22","1a",1,null,null,null,2483909,2562408,789910,1809,19130,4.22,1493,0,0.03,0.8,650.02,1585,177.99,509.91,2026.82,8.4,1790,2.33,6.14,11.73]
["ES",2014,"C22","1b",1,null,null,null,2300864,2833521,721294,119,11793,6.69,116,0.08,1.1399999999999999,4.63,1183.67,117,500.84,999.57,4096.01,9.98,119,4.91,8.19,13.96]
["ES",2014,"C23",0,1,42.09,null,51.23,19370899,7871756,2224528,2705,41815,48.83,1670,0,0.05,2.04,497.87,2354,-526.41,194.59,907.29,14.72,2677,-8.4600000000000009,3.12,9.01]
["ES",2014,"C23",1,1,null,null,null,6759090,3838594,1083778,2671,27397,16.059999999999999,1638,0,0.04,1.87,330.78,2320,-552.01,187.71,895.09,5.52,2643,-8.8000000000000007,3.03,8.76]
["ES",2014,"C23",2,1,null,null,null,12611808,4033162,1140750,34,14418,56.17,32,0.8,3,25.97,561.48,34,412.84,723.75,3887.61,23.48,34,8.73,13.22,19.5]
["ES",2014,"C23","1a",1,null,null,null,4021038,2039998,607096,2575,18904,26.43,1555,0,0.03,1.47,227.45,2227,-610.79,174.48,848.38,3.62,2547,-9.44,2.71,8.4600000000000009]
["ES",2014,"C23","1b",1,null,null,null,2738052,1798595,476681,96,8493,10.52,83,0.49,2.04,7.94,436.98,93,268.57,508.94,2298.4899999999998,7.67,96,5.35,8.4,12.98]
["ES",2014,"C24",0,1,100,null,100,19664306,20777083,2924544,1101,42061,27.16,864,0,7.0000000000000007E-2,2.15,452.94,935,138.78,461.98,2020,5.71,1092,0.91,5.2,11.02]
["ES",2014,"C24",1,1,null,null,null,2589640,2649041,714740,1053,14366,12.84,822,0,0.05,1.92,687.99,887,133,450.45,2024.45,7.95,1044,0.83,5.2,11.34]
["ES",2014,"C24",2,1,null,null,null,17074665,18128041,2209803,48,27695,30.25,42,0.46,2.21,8.16,421.82,48,297.64999999999998,603.30999999999995,1774.62,5.38,48,1.75,5.24,9.82]
["ES",2014,"C24","1a",1,null,null,null,1216634,1072934,366327,987,8763,6.56,759,0,0.02,1.59,588.79999999999995,825,128.37,437.83,1932.27,6.91,978,0.52,5.09,11.09]
["ES",2014,"C24","1b",1,null,null,null,1373006,1576106,348413,66,5603,16.29,63,0.36,1.57,11.93,757.65,62,243.16,574.99,3205.88,8.67,66,3.15,6.48,11.58]
["ES",2014,"C25",0,1,45.75,null,52.54,13736912,13863961,4458511,9427,95713,7.06,7003,0,0.01,0.74,749.37,8014,52.02,412.28,1743.68,7.92,9346,-0.13,4.71,10.37]
["ES",2014,"C25",1,1,null,null,null,10673554,10107557,3622756,9392,83850,4.93,6970,0,0.01,0.71,657.15,7979,50.35,408.65,1734.45,7.76,9311,-0.17,4.6900000000000004,10.37]
["ES",2014,"C25",2,1,null,null,null,3063357,3756404,835754,35,11863,12.83,33,0.64,4.29,15.94,1159.55,35,574.29,1439.18,3981.14,8.41,35,5.0999999999999996,8.5,11.12]
["ES",2014,"C25","1a",1,null,null,null,7672622,6874124,2720438,9231,68844,4.42,6817,0,0.01,0.61,545.95000000000005,7822,38.340000000000003,399.87,1718.57,6.89,9150,-0.31,4.5999999999999996,10.31]
["ES",2014,"C25","1b",1,null,null,null,3000931,3233432,902317,161,15006,5.71,153,0.3,2.12,7.58,952.96,157,383.68,955.99,3150.1,9.61,161,5.12,8.17,12.34]
["ES",2014,"C26",0,1,38.36,null,47.96,2127396,1954162,601863,712,11299,12.18,551,0,7.0000000000000007E-2,2.46,957.54,549,112.89,486.16,2822.35,8.85,701,0.85,5.55,12.13]
["ES",2014,"C26",1,1,null,null,null,1644164,1262500,463613,704,9365,14.93,544,0,7.0000000000000007E-2,2.34,695.72,541,102.88,475.52,2550.6,9.39,693,0.8,5.52,12.13]
["ES",2014,"C26",2,1,null,null,null,483232,691662,138250,8,1934,7.68,7,null,5.54,null,5463.78,8,null,6167.77,null,7.98,8,null,9.56]
["ES",2014,"C26","1a",1,null,null,null,818214,649080,256351,673,5695,9.1199999999999992,516,0,0.04,1.45,705.02,512,86.84,442.04,2594.33,8.59,662,0.56000000000000005,5.43,12.13]
["ES",2014,"C26","1b",1,null,null,null,825950,613419,207261,31,3670,20.11,28,2.82,8.9700000000000006,32.28,687.87,29,445.9,1051.03,2250.66,10.25,31,4.67,6.19,12.86]
["ES",2014,"C27",0,1,51.47,null,65.41,11586455,10607890,2467455,911,36425,7.97,684,0,0.12,3.08,641.02,756,57.7,452.87,2113.4,7.8,905,0.22,4.63,9.93]
["ES",2014,"C27",1,1,null,null,null,2239251,1872298,592118,880,12643,7.1,655,0,0.09,2.75,462.92,725,23,422.99,1984.65,7.11,874,0,4.53,9.6999999999999993]
["ES",2014,"C27",2,1,null,null,null,9347203,8735592,1875337,31,23782,8.1300000000000008,29,0.86,4.5999999999999996,15.41,692.04,31,375.48,1078.46,5605.73,7.95,31,2.61,8.83,12.23]
["ES",2014,"C27","1a",1,null,null,null,933399,831523,284876,826,7152,7.67,604,0,0.04,2.04,471.29,674,-29.27,376.15,1787.3,5.52,820,-0.57999999999999996,4.3499999999999996,9.5399999999999991]
["ES",2014,"C27","1b",1,null,null,null,1305851,1040774,307241,54,5491,6.8,51,0.73,3.71,8.41,458.64,51,465.62,969.14,3307.89,8.3699999999999992,54,4.26,7.41,11.79]
["ES",2014,"C28",0,1,65.930000000000007,null,68.540000000000006,11126163,10122929,3706628,3240,62458,22.66,2667,0,0.08,1.87,1392.56,2790,172.57,588.87,2834.7,13.58,3206,1.98,5.86,11.52]
["ES",2014,"C28",1,1,null,null,null,7059701,6231022,2237605,3209,44045,7.58,2637,0,7.0000000000000007E-2,1.78,779.8,2763,170.57,582.74,2809.57,9.11,3175,1.96,5.8,11.51]
["ES",2014,"C28",2,1,null,null,null,4066461,3891907,1469023,31,18413,33.270000000000003,30,0.76,3.75,14.54,3114.04,27,356.02,1547.08,8498.7999999999993,20.74,31,6.47,9.51,12.79]
["ES",2014,"C28","1a",1,null,null,null,4193756,3713890,1411823,3090,30911,5.61,2526,0,0.06,1.52,657.8,2653,166.93,563.17999999999995,2681.13,8.09,3056,1.88,5.68,11.26]
["ES",2014,"C28","1b",1,null,null,null,2865945,2517131,825683,119,13134,9.8000000000000007,111,0.66,3.44,9.66,984.69,110,399.97,1266.23,4787.4399999999996,10.62,119,4.92,10.199999999999999,14.99]
["ES",2014,"C29",0,1,53.26,null,79.2,25351102,50110105,7823558,800,110010,4.68,654,0,0.09,1.81,1392.43,684,177.07,585.54,2602.85,6.28,791,1.83,5.26,10.94]
["ES",2014,"C29",1,1,null,null,null,2454664,2686976,870785,737,18081,9.26,593,0,7.0000000000000007E-2,1.57,1070.05,625,163.49,522.91,2099.4699999999998,9.3800000000000008,728,1.65,5.04,10.96]
["ES",2014,"C29",2,1,null,null,null,22896437,47423128,6952772,63,91929,4.3,61,0.03,0.92,4.9800000000000004,1430.21,59,613.32000000000005,3024.05,7616.62,6.11,63,4.43,7.22,10.23]
["ES",2014,"C29","1a",1,null,null,null,906591,828672,314074,657,7893,7.63,520,0,0.04,1.03,664.74,552,139.85,470.58,1815.43,8.27,648,1.45,4.72,10.3]
["ES",2014,"C29","1b",1,null,null,null,1548073,1858304,556711,80,10188,9.8699999999999992,73,7.0000000000000007E-2,1.52,8.92,1385.91,73,372.3,1502.63,4475.4399999999996,9.8699999999999992,80,3.48,8.08,14.87]
["ES",2014,"C30",0,1,49.49,null,74.83,20320367,8763460,2592041,293,34914,27.87,213,0,0.21,2.5,321.08,249,7.99,419.39,2240.4299999999998,7.96,289,-0.51,5,11.25]
["ES",2014,"C30",1,1,null,null,null,1087648,887602,324000,276,6690,4.7300000000000004,199,0,0.13,1.88,635.25,232,-0.98,403.52,2199.5,8.2899999999999991,272,-0.8,4.79,10.78]
["ES",2014,"C30",2,1,null,null,null,19232719,7875858,2268041,17,28224,30.66,14,2.0699999999999998,6.36,11.05,303.64999999999998,17,161.58000000000001,807.98,3158.41,7.93,17,3,11.05,15.74]
["ES",2014,"C30","1a",1,null,null,null,365033,234956,111936,248,2718,7.82,173,0,0.05,1.35,695.48,206,-89.6,342.01,2127.04,9.1999999999999993,244,-1.83,4.28,10.78]
["ES",2014,"C30","1b",1,null,null,null,722614,652646,212063,28,3972,3.44,26,0.15,1.42,3.96,613.16999999999996,26,337.71,667.82,2681.63,7.97,28,4.93,8.57,10.71]
["ES",2014,"C31",0,1,45.68,null,50.47,2676688,2082956,656308,2896,21760,27.58,1758,0,0,0.45,266.98,2401,-610.6,178.47,797.58,4.3600000000000003,2854,-10.32,2.35,7.11]
["ES",2014,"C31",1,1,null,null,null,2288141,1923071,605900,2894,20605,10.56,1756,0,0,0.44,267.98,2399,-610.94000000000005,177.56,798,3.8,2852,-10.34,2.34,7.09]
["ES",2014,"C31",2,1,null,null,null,null,null,null,2,null,null,2,null,null,null,null,2,null,null,null,null,2]
["ES",2014,"C31","1a",1,null,null,null,1844235,1500201,482635,2873,17924,13.28,1735,0,0,0.41,157.91999999999999,2379,-626.58000000000004,173.28,790.29,2.35,2831,-10.47,2.29,6.98]
["ES",2014,"C31","1b",1,null,null,null,443906,422869,123265,21,2681,8.06,21,0.27,2.06,9.99,758.07,20,421.59,717.08,2732.96,8.9700000000000006,21,5.69,8.74,11.43]
["ES",2014,"C32",0,1,51.25,null,60.68,2342594,2201062,734031,1852,16785,3.81,1371,0,0,0.75,869.19,1446,27.86,451.39,1979.89,9.26,1831,-0.27,4.93,11.53]
["ES",2014,"C32",1,1,null,null,null,1849622,1759974,612141,1849,15370,3.91,1368,0,0,0.74,703.18,1443,27.17,450.98,1979.2,8.1300000000000008,1828,-0.28999999999999998,4.92,11.53]
["ES",2014,"C32",2,1,null,null,null,null,null,null,3,null,null,3,null,null,null,null,3,null,null,null,null,3]
["ES",2014,"C32","1a",1,null,null,null,1390549,1206500,451710,1826,12570,5.12,1345,0,0,0.64,574.71,1422,13.71,430.8,1948.28,7.49,1805,-0.42,4.9000000000000004,11.51]
["ES",2014,"C32","1b",1,null,null,null,459072,553474,160430,23,2800,1.88,23,0.44,1.28,6.41,1140.1400000000001,21,934.87,1666.82,3532.73,9.5399999999999991,23,5.93,9.2799999999999994,11.64]
["ES",2014,"C33",0,1,77.31,null,49.63,4064329,3118488,1301480,4052,30001,6.16,2974,0,0,0.51,807.03,3202,15.46,497.08,2531.1999999999998,8.0500000000000007,4022,-0.39,3.84,9.5]
["ES",2014,"C33",1,1,null,null,null,2675881,2642652,1112785,4047,27376,5,2969,0,0,0.5,667.38,3199,14.61,496.97,2535.48,6.89,4017,-0.4,3.84,9.49]
["ES",2014,"C33",2,1,null,null,null,null,null,null,5,null,null,5,null,null,null,null,3,null,null,null,null,5]
["ES",2014,"C33","1a",1,null,null,null,2093961,2196035,946951,4022,24339,3.51,2946,0,0,0.48,677,3178,10.45,486.84,2491.29,6.6,3992,-0.44,3.82,9.4700000000000006]
["ES",2014,"C33","1b",1,null,null,null,581920,446617,165833,25,3037,10.84,23,null,null,null,632.41999999999996,21,null,null,null,8.34,25]
["ES",2014,"D",0,1,90.69,null,87.95,237381771,100401883,15491113,12002,31727,18.97,10914,0,0,0.17,552.30999999999995,9085,178.31,367.35,843.89,15.5,11964,25.23,70.790000000000006,79.489999999999995]
["ES",2014,"D",1,1,null,null,null,11623032,2203548,1043770,11946,4057,3.93,10862,0,0,0.16,282.54000000000002,9030,178.13,366.73,839,42.05,11908,26.05,70.83,79.510000000000005]
["ES",2014,"D",2,1,null,null,null,225758739,98198335,14447343,56,27670,19.920000000000002,52,-0.18,0.16,12.83,587.85,55,271.58999999999997,816.4,2549.64,14.9,56,7.81,27.86,68.28]
["ES",2014,"D","1a",1,null,null,null,7367825,1362602,682362,11904,3143,5.67,10823,0,0,0.16,358.36,8992,178.29,366.61,838.2,45.25,11866,26.25,70.83,79.52]
["ES",2014,"D","1b",1,null,null,null,4255206,840945,361407,42,914,0.47,39,0,0.28000000000000003,1.77,198.89,38,132.41,389.83,2082.4299999999998,36.880000000000003,42,6.11,59.93,68.44]
["ES",2014,"D35",0,1,90.69,null,87.95,237381771,100401883,15491113,12002,31727,18.97,10914,0,0,0.17,552.30999999999995,9085,178.31,367.35,843.89,15.5,11964,25.23,70.790000000000006,79.489999999999995]
["ES",2014,"D35",1,1,null,null,null,11623032,2203548,1043770,11946,4057,3.93,10862,0,0,0.16,282.54000000000002,9030,178.13,366.73,839,42.05,11908,26.05,70.83,79.510000000000005]
["ES",2014,"D35",2,1,null,null,null,225758739,98198335,14447343,56,27670,19.920000000000002,52,-0.18,0.16,12.83,587.85,55,271.58999999999997,816.4,2549.64,14.9,56,7.81,27.86,68.28]
["ES",2014,"D35","1a",1,null,null,null,7367825,1362602,682362,11904,3143,5.67,10823,0,0,0.16,358.36,8992,178.29,366.61,838.2,45.25,11866,26.25,70.83,79.52]
["ES",2014,"D35","1b",1,null,null,null,4255206,840945,361407,42,914,0.47,39,0,0.28000000000000003,1.77,198.89,38,132.41,389.83,2082.4299999999998,36.880000000000003,42,6.11,59.93,68.44]
["ES",2014,"E",0,1,46.8,null,78.13,38781858,10489863,5611924,1506,90470,22.23,1238,0,7.0000000000000007E-2,1.83,543.34,1223,190.42,735.08,3136,29.13,1492,2.14,8.9,19.809999999999999]
["ES",2014,"E",1,1,null,null,null,6335895,3336588,1428298,1468,28813,8.24,1200,0,0.06,1.54,620.92999999999995,1189,184.26,725.62,3151.88,15.14,1454,2.02,8.64,19.12]
["ES",2014,"E",2,1,null,null,null,null,null,null,38,null,null,38,null,null,null,null,34,null,null,null,null,38]
["ES",2014,"E","1a",1,null,null,null,2204450,1360671,525682,1380,12752,6.29,1115,0,0.04,1.37,742.16,1107,172.02,713.72,3148.52,11.83,1366,1.76,8.08,18.399999999999999]
["ES",2014,"E","1b",1,null,null,null,4131444,1975916,902615,88,16061,9.15,85,0.17,1.49,8.91,576.83000000000004,82,353.89,920.93,3669.93,17.41,88,7.18,15.13,25.72]
["ES",2014,"E36",0,1,47.72,null,80.010000000000005,21103439,4626018,2330595,419,25427,21.14,355,0,0.41,3.78,900.5,322,211.89,962.08,4780.08,33.24,414,4.28,12.3,24.54]
["ES",2014,"E36",1,1,null,null,null,2963664,1143096,518395,393,7509,7.4,329,0,0.28999999999999998,3.27,506.71,299,194.22,974.86,5032.99,19.829999999999998,388,3.79,11.55,23.91]
["ES",2014,"E36",2,1,null,null,null,18139775,3482922,1812200,26,17918,23.52,26,1.43,9.2100000000000009,24.74,1040.3,23,734.67,948.22,1875.44,37.64,26,19.59,25.95,46.68]
["ES",2014,"E36","1a",1,null,null,null,843004,331322,142812,356,2714,4.26,293,0,0.17,2.61,809.11,266,181.16,975.89,5323.35,16.510000000000002,351,3.01,10.56,22.87]
["ES",2014,"E36","1b",1,null,null,null,2120660,811773,375583,37,4795,8.4,36,0.14000000000000001,1.51,11.56,452.88,33,365.7,882.81,1731.73,21.19,37,11.61,17.559999999999999,28.97]
["ES",2014,"E37",0,1,37.97,null,35.200000000000003,634248,191021,86030,101,1244,19.32,92,0,0.09,1.6,1226.19,92,209.13,934.91,2510.4,22.85,100,4.3099999999999996,11.55,25.68]
["ES",2014,"E37",1,1,null,null,null,634248,191021,86030,101,1244,19.32,92,0,0.09,1.6,1226.19,92,209.13,934.91,2510.4,22.85,100,4.3099999999999996,11.55,25.68]
["ES",2014,"E37",2,1,null,null,null,null,null,null,0,null,null,0,null,null,null,null,0,null,null,null,null,0]
["ES",2014,"E37","1a",1,null,null,null,131385,67525,33548,95,760,10.11,86,0,7.0000000000000007E-2,0.95,529.84,87,199.78,910.6,2338.0300000000002,16.350000000000001,94,4.21,11.23,24.72]
["ES",2014,"E37","1b",1,null,null,null,502863,123495,52482,6,484,22.44,6,null,null,null,null,5,null,null,null,26.41,6]
["ES",2014,"E38",0,1,42.41,null,78.87,16744166,5461501,3131322,816,62345,23.67,654,0,0.04,1.35,377.86,673,183.87,677.93,2654.35,26.66,808,1.48,7.95,17.29]
["ES",2014,"E38",1,1,null,null,null,2437978,1791148,759896,804,18606,7.08,642,0,0.03,1.25,714.62,662,181.43,675.65,2666.78,12.08,796,1.47,7.9,16.98]
["ES",2014,"E38",2,1,null,null,null,null,null,null,12,null,null,12,null,null,null,null,11,null,null,null,null,12]
["ES",2014,"E38","1a",1,null,null,null,1085105,840574,304407,764,8110,6.83,604,0,0.02,1.06,737.01,622,171.63,666.6,2631.11,10.07,756,1.29,7.74,16.899999999999999]
["ES",2014,"E38","1b",1,null,null,null,1352872,950573,455488,40,10496,7.23,38,null,null,null,700.93,40,null,null,null,13.85,40]
["ES",2014,"E39",0,1,100,null,100,300004,211322,63976,170,1454,5.94,137,0,0.01,0.74,664.23,136,153,583.72,2749.97,8.66,170,0.75,7.21,13.66]
["ES",2014,"E39",1,1,null,null,null,300004,211322,63976,170,1454,5.94,137,0,0.01,0.74,664.23,136,153,583.72,2749.97,8.66,170,0.75,7.21,13.66]
["ES",2014,"E39",2,1,null,null,null,null,null,null,0,null,null,0,null,null,null,null,0,null,null,null,null,0]
["ES",2014,"E39","1a",1,null,null,null,144955,121248,44914,165,1168,8.4700000000000006,132,0,0,0.46,777.86,132,144.86000000000001,572.82000000000005,2532.2600000000002,8.76,165,0.71,7.16,13.87]
["ES",2014,"E39","1b",1,null,null,null,null,null,null,5,null,null,5,null,null,null,null,4,null,null,null,null,5]
["ES",2014,"F",0,1,28.69,null,54.24,109603242,41890217,13456687,60964,329487,33.19,38944,0,0,0.47,222.58,45816,-386.66,249.63,1426.34,7.53,57974,-7.32,3.28,11.48]
["ES",2014,"F",1,1,null,null,null,60463178,23499725,8667458,60879,257296,22.88,38876,0,0,0.46,211.13,45732,-388.71,249.47,1426.69,5.15,57889,-7.36,3.28,11.47]
["ES",2014,"F",2,1,null,null,null,49140064,18390491,4789228,85,72191,39.630000000000003,68,6.49,25.67,52.3,230.4,84,100.57,372.02,978.78,10.57,85,2.6,6.69,15.78]
["ES",2014,"F","1a",1,null,null,null,50582118,19706633,7411436,60626,231422,18.97,38671,0,0,0.43,235.43,45489,-396.18,247.84,1426.44,4.57,57641,-7.43,3.27,11.48]
["ES",2014,"F","1b",1,null,null,null,9881082,3793092,1256022,253,25874,34.25,205,1.03,6,19.82,162.4,243,118.94,442.34,1537.01,8.17,248,1.72,4.9400000000000004,10.79]
["ES",2014,"F41",0,1,18.920000000000002,null,34.29,58596383,10985645,2334331,27559,83110,270972.84000000003,16733,0,0,0.78,0.01,20241,-468.87,176.84,1220.72,0,25029,-12.79,3.58,20.25]
["ES",2014,"F41",1,1,null,null,null,40254447,7425257,2397063,27539,75941,39.24,16720,0,0,0.77,120.41,20221,-469.47,176.84,1221.3499999999999,5.71,25009,-12.78,3.57,20.260000000000002]
["ES",2014,"F41",2,1,null,null,null,18341935,3560388,-62731,20,7169,-11.22,13,2.38,42.54,78.540000000000006,-149.12,20,-138.81,176.52,449.51,-11.91,20,-25.87,3.77,6.05]
["ES",2014,"F41","1a",1,null,null,null,34694871,6487022,2227115,27449,72271,31.53,16657,0,0,0.75,166.58,20134,-476.47,176.8,1224.94,5.62,24924,-12.79,3.57,20.28]
["ES",2014,"F41","1b",1,null,null,null,null,null,null,90,null,null,63,null,null,null,null,87,null,null,null,null,85]
["ES",2014,"F42",0,1,93.25,null,88.05,27094931,13307720,4263733,1727,59890,23.72,1216,0,0.04,2.4500000000000002,391.03,1390,-66.8,334.72,1545.12,14.12,1685,-1.9,4.22,12]
["ES",2014,"F42",1,1,null,null,null,4451103,2474078,872840,1687,20679,26.49,1180,0,0.03,2,369.2,1350,-86.88,329.09,1569.71,8.02,1645,-2.4900000000000002,4.13,11.71]
["ES",2014,"F42",2,1,null,null,null,22643828,10833642,3390893,40,39211,23.4,36,6.45,27.21,50.57,393.82,40,148.79,401.96,1086.44,15.51,40,4.4800000000000004,11.34,16.48]
["ES",2014,"F42","1a",1,null,null,null,2172234,1330946,474194,1630,12850,16.98,1130,0,0.02,1.36,270.77,1296,-105.75,322.42,1499.67,4.8499999999999996,1588,-3.18,4.05,11.54]
["ES",2014,"F42","1b",1,null,null,null,2278868,1143131,398645,57,7829,31.09,50,2.57,7.06,17.22,447.8,54,182.51,646.45000000000005,1828.06,11.71,57,3.22,7.2,12.29]
["ES",2014,"F43",0,1,48.74,null,62.77,23911957,17596850,6858622,31678,186487,30.5,20995,0,0,0.28000000000000003,425.84,24185,-343.36,310.67,1575.11,7.26,31260,-4.9800000000000004,3.09,8.76]
["ES",2014,"F43",1,1,null,null,null,15757657,13600389,5397555,31653,160676,9.89,20976,0,0,0.28000000000000003,351.24,24161,-344.25,310.60000000000002,1575.2,4.33,31235,-4.99,3.09,8.76]
["ES",2014,"F43",2,1,null,null,null,8154300,3996461,1461067,25,25811,48.13,19,13.27,23.45,46.01,520.5,24,36.56,425.89,725.51,17.23,25,0.4,7.81,14.3]
["ES",2014,"F43","1a",1,null,null,null,13715033,11888664,4710127,31547,146301,9.5299999999999994,20884,0,0,0.27,337.27,24059,-353.47,308.82,1572.93,3.97,31129,-5.05,3.08,8.75]
["ES",2014,"F43","1b",1,null,null,null,2042625,1711725,687428,106,14375,11.36,92,0.36,4.13,9.5500000000000007,421.72,102,223.44,564.87,1747.5,6.84,106,2.2000000000000002,4.5,8.93]
["ES",2014,"G",0,1,39.479999999999997,null,64.03,221461088,344637639,47863017,117094,1178663,19.420000000000002,81179,0,0.01,1.06,774.5,89348,-116.36,327.66000000000003,1581.97,4.6900000000000004,115565,-1.99,2.34,6.48]
["ES",2014,"G",1,1,null,null,null,98216096,134582595,22627758,116630,634675,8.34,80746,0,0.01,1.03,529.71,88922,-120.26,325.49,1568.09,3.79,115103,-2.0299999999999998,2.33,6.48]
["ES",2014,"G",2,1,null,null,null,123245364,210055043,25235237,464,543988,24.53,433,0.47,3.25,12.9,983.92,426,407.27,1261.51,5754.63,5.27,462,1.91,4.07,7.24]
["ES",2014,"G","1a",1,null,null,null,72438543,89244087,16346171,114357,504754,8.1999999999999993,78627,0,0.01,0.89,426.83,86866,-144.05000000000001,316.95,1534.64,3.4,112830,-2.27,2.2999999999999998,6.49]
["ES",2014,"G","1b",1,null,null,null,25777594,45338507,6281587,2273,129921,8.5399999999999991,2119,0.25,1.92,6.85,818.76,2056,285.35000000000002,751.82,3219.58,4.5599999999999996,2273,1.47,3.13,5.88]
["ES",2014,"G45",0,1,46.33,null,62.45,16929058,28520884,4121761,16334,107998,6.82,10288,0,0,0.73,542.58000000000004,12692,-435.08,226.14,1027.9100000000001,2.79,16200,-4.7300000000000004,1.64,5.13]
["ES",2014,"G45",1,1,null,null,null,12571486,18229188,3338218,16293,95622,8.58,10250,0,0,0.71,411.38,12653,-443.08,225.18,1022.67,2.89,16159,-4.76,1.63,5.14]
["ES",2014,"G45",2,1,null,null,null,4357572,10291696,783543,41,12376,3.39,38,0.17,1.84,5.78,1446.24,39,310.48,973.56,2176.11,2.61,41,1.27,2.79,3.87]
["ES",2014,"G45","1a",1,null,null,null,8489734,10318673,2289546,15906,73433,11.82,9905,0,0,0.59,296.45,12282,-494.41,215.6,1007.68,2.4500000000000002,15772,-5.12,1.6,5.19]
["ES",2014,"G45","1b",1,null,null,null,4081752,7910514,1048671,387,22189,5.59,345,0.13,1.57,6.2,641.46,371,242.11,518.42999999999995,1290.08,3.46,387,1.22,2.41,4.1500000000000004]
["ES",2014,"G46",0,1,37.82,null,54.52,122002278,196167140,21807713,54681,431572,25.85,41404,0,0.04,1.68,801.2,42168,108.08,429.54,2143.59,4.59,53810,0.26,3,7.68]
["ES",2014,"G46",1,1,null,null,null,61540785,83841623,13214457,54389,318223,8.35,41132,0,0.03,1.63,597.08000000000004,41899,106.73,425.94,2129.5100000000002,4.32,53519,0.24,3,7.68]
["ES",2014,"G46",2,1,null,null,null,60461840,112325517,8593235,292,113349,37.61,272,0.62,3.97,14.96,1040.17,269,366.78,1116.0899999999999,4327.6899999999996,4.8,291,2.16,4.25,7.72]
["ES",2014,"G46","1a",1,null,null,null,43713277,53423925,9159240,52860,244961,7.79,39676,0,0.02,1.44,498.25,40510,95.01,412.31,2084.25,4.01,51990,0.15,2.98,7.74]
["ES",2014,"G46","1b",1,null,null,null,17827508,30417697,4055216,1529,73262,9.17,1456,0.27,1.84,7.11,838.67,1389,305.79000000000002,860.18,3720,4.8499999999999996,1529,1.63,3.42,6.35]
["ES",2014,"G47",0,1,39.46,null,72.930000000000007,82529903,119949614,21933534,46079,639093,11.97,29487,0,0,0.48,780.08,34488,-380.71,259.5,1229.48,5.31,45555,-4.45,1.75,5.64]
["ES",2014,"G47",1,1,null,null,null,24103951,32511783,6075075,45948,220830,8.26,29364,0,0,0.46,417.47,34370,-384.34,257.37,1219.5,2.93,45425,-4.49,1.74,5.63]
["ES",2014,"G47",2,1,null,null,null,58425952,87437830,15858459,131,418263,12.63,123,0.4,2.4900000000000002,10.48,920.58,118,570.91999999999996,1734.16,17522.150000000001,6.2,130,2.0099999999999998,4.43,7.46]
["ES",2014,"G47","1a",1,null,null,null,20235604,25501488,4897384,45591,186360,8.3000000000000007,29046,0,0,0.42,326.35000000000002,34074,-393.36,254.82,1205.4100000000001,2.48,45068,-4.59,1.72,5.63]
["ES",2014,"G47","1b",1,null,null,null,3868352,7010295,1177690,357,34470,8.24,318,0.34,2.82,5.81,939.25,296,240.57,835.4,4226.87,4.55,357,1.43,3.13,6.09]
["ES",2014,"H",0,1,36.67,null,69.33,175484120,53687907,22914644,18031,352920,5.94,13790,0,0.01,0.87,470.58,14607,118.2,607.49,2197.81,17.600000000000001,17789,0.54,5.98,14.26]
["ES",2014,"H",1,1,null,null,null,26731606,22182150,7467046,17897,165492,5.26,13665,0,0.01,0.83,646.36,14481,116.61,606.65,2197.19,9.6999999999999993,17656,0.52,5.96,14.2]
["ES",2014,"H",2,1,null,null,null,148752514,31505757,15447597,134,187428,6.16,125,0.84,5.24,13.57,435.71,126,258.8,746.44,2411.3200000000002,23.17,133,3.39,8.11,52.12]
["ES",2014,"H","1a",1,null,null,null,13822769,14362425,4776547,17492,121280,4.8899999999999997,13280,0,0.01,0.72,729.61,14114,107.3,598.92999999999995,2158.38,8.11,17253,0.42,5.94,14.18]
["ES",2014,"H","1b",1,null,null,null,12908836,7819725,2690498,405,44212,5.69,385,0.14000000000000001,1.89,7.72,569.61,367,390.34,974.15,4402.9399999999996,12.61,403,3.1,6.38,15.7]
["ES",2014,"H49",0,1,40.5,null,68.66,45737065,24251152,9484459,12832,177138,8.65,9857,0,0.01,0.6,482.83,10649,127.48,606.88,2007.24,12.92,12680,0.79,6.7,14.37]
["ES",2014,"H49",1,1,null,null,null,12604145,13606488,4731953,12781,114093,3.82,9810,0,0,0.57999999999999996,708.94,10601,126.94,606.79999999999995,2009.27,8.4600000000000009,12629,0.76,6.7,14.39]
["ES",2014,"H49",2,1,null,null,null,33132919,10644663,4752505,51,63045,11.46,47,0.96,6.22,13.99,407.39,48,283.52999999999997,746.44,1613.32,18.63,51,2.89,5.66,9.1199999999999992]
["ES",2014,"H49","1a",1,null,null,null,8436146,9487963,3322899,12569,86428,3.48,9612,0,0,0.51,722.62,10405,120.41,602.04999999999995,1982.42,8.31,12417,0.67,6.74,14.43]
["ES",2014,"H49","1b",1,null,null,null,4167999,4118524,1409053,212,27665,4.54,198,0.15,1.8,6.63,680.95,196,384.34,884.52,3000.73,8.82,212,2.82,5.81,11.94]
["ES",2014,"H50",0,1,100,null,100,1469526,1217042,318942,455,4816,9.5500000000000007,308,0,0.02,1.7,576.03,342,-87.56,468.67,3205.21,12.01,445,-3.67,3.94,13.45]
["ES",2014,"H50",1,1,null,null,null,643348,648495,166184,453,3180,5.35,306,0,0.02,1.68,1028.42,340,-99.18,468.67,3213.33,8.65,443,-3.86,3.91,13.44]
["ES",2014,"H50",2,1,null,null,null,null,null,null,2,null,null,2,null,null,null,null,2,null,null,null,null,2]
["ES",2014,"H50","1a",1,null,null,null,443246,364258,117343,442,2559,6.66,295,0,0.01,1.43,1055.1199999999999,329,-172.79,424.18,3104.31,10.26,432,-4.91,3.89,13.5]
["ES",2014,"H50","1b",1,null,null,null,200102,284236,48840,11,621,2.8,11,null,null,null,979.7,11,null,null,null,6.58,11]
["ES",2014,"H51",0,1,62.88,null,87.1,7274152,8070109,2038741,144,24569,-9.51,103,0,0.08,3.4,1231.92,104,-458.12,403.24,3271.88,3.82,141,-3.43,3.93,15.15]
["ES",2014,"H51",1,1,null,null,null,266078,250406,67326,137,1089,14.14,97,0,7.0000000000000007E-2,2.96,557.46,98,-479.81,332.82,2955.73,8.68,134,-3.54,3.55,14.82]
["ES",2014,"H51",2,1,null,null,null,7008074,7819702,1971414,7,23480,-11.29,6,null,6.15,null,1356.67,6,null,10144.14,null,3.66,7,null,7.46]
["ES",2014,"H51","1a",1,null,null,null,107856,105529,24195,130,587,9.68,90,0,0.03,2.27,577.86,93,-533.25,317.99,3078.03,5.97,127,-4.88,3.24,15.14]
["ES",2014,"H51","1b",1,null,null,null,158222,144877,43131,7,502,15.96,7,null,null,null,null,5,null,null,null,10.66,7]
["ES",2014,"H52",0,1,29.72,null,53.91,118032101,17742992,9633125,4158,86746,5.03,3228,0,0.06,2.27,459.28,3165,127.17,653.35,3211.64,33.76,4085,0.54,4.51,14.71]
["ES",2014,"H52",1,1,null,null,null,13024610,7394930,2411589,4089,43393,7.05,3160,0,0.05,2.09,575.57000000000005,3100,120.62,649.20000000000005,3192.18,12.36,4017,0.49,4.4400000000000004,14.42]
["ES",2014,"H52",2,1,null,null,null,105007491,10348061,7221535,69,43353,4.71,68,0.21,4.5999999999999996,10.82,443.33,65,235.54,762.35,3637.55,49.07,68,3.93,27.58,73.73]
["ES",2014,"H52","1a",1,null,null,null,4666039,4166107,1229833,3917,28163,8.0299999999999994,2994,0,0.04,1.69,741.13,2948,105.9,629.62,3107.55,7.81,3847,0.36,4.25,13.99]
["ES",2014,"H52","1b",1,null,null,null,8358571,3228823,1181756,172,15230,6.51,166,0.1,2.4700000000000002,11.63,512.27,152,426.97,1089.0899999999999,5156.71,18.23,170,3.46,8.42,24.35]
["ES",2014,"H53",0,1,100,null,100,2971297,2406611,1439360,442,59651,-8.51,294,0,0,0.3,-2694.75,347,-221.23,386.1,1587.92,-5.07,438,-2.42,2.79,6.65]
["ES",2014,"H53",1,1,null,null,null,193446,281829,89976,437,3737,5.94,292,0,0,0.27,436.64,342,-197.09,387.33,1677.59,3.42,433,-2.25,2.81,6.66]
["ES",2014,"H53",2,1,null,null,null,null,null,null,5,null,null,2,null,null,null,null,5,null,null,null,null,5]
["ES",2014,"H53","1a",1,null,null,null,169504,238566,82275,434,3543,5.85,289,0,0,0.26,369.9,339,-208.86,375.91,1587.92,3.1,430,-2.2999999999999998,2.79,6.65]
["ES",2014,"H53","1b",1,null,null,null,null,null,null,3,null,null,3,null,null,null,null,3,null,null,null,null,3]
["ES",2014,"I",0,1,35.79,null,52.52,35823186,21098738,9560435,29334,324421,15.21,18910,0,0,0.17,398.56,21967,-336.88,327.31,1522.23,10.24,28851,-4.3499999999999996,2.65,8.8800000000000008]
["ES",2014,"I",1,1,null,null,null,24135799,16148539,7131566,29294,245517,7.48,18874,0,0,0.17,491.91,21929,-339.05,326.66000000000003,1521.27,9.26,28811,-4.3600000000000003,2.65,8.8699999999999992]
["ES",2014,"I",2,1,null,null,null,11687387,4950199,2428869,40,78904,32.590000000000003,36,0.31,1.96,22.58,279.35000000000002,38,206.47,851.2,3296.34,13.44,40,4.7,10.55,16.13]
["ES",2014,"I","1a",1,null,null,null,18094934,13535577,5750140,29163,209889,4.5,18744,0,0,0.16,468.91,21802,-348.84,323.16000000000003,1514.43,7.17,28680,-4.42,2.61,8.7899999999999991]
["ES",2014,"I","1b",1,null,null,null,6040864,2612961,1381425,131,35628,12.98,130,0.36,1.41,6.8,540.88,127,408.33,1075.32,3158.09,20.12,131,8.5,16.98,26.65]
["ES",2014,"I55",0,1,48.12,null,54.34,25691767,8417860,4304469,6481,105559,17.510000000000002,4817,0,0.01,0.63,405.45,5221,36.659999999999997,425,1734.22,18.3,6327,0.06,9.5,22.57]
["ES",2014,"I55",1,1,null,null,null,16630018,6275624,3210886,6464,79867,8.34,4804,0,0.01,0.62,534.38,5205,36.659999999999997,424.98,1734.22,18.04,6310,0.05,9.48,22.55]
["ES",2014,"I55",2,1,null,null,null,null,null,null,17,null,null,13,null,null,null,null,16,null,null,null,null,17]
["ES",2014,"I55","1a",1,null,null,null,11035160,4482816,2230031,6372,60650,4.24,4712,0,0.01,0.56999999999999995,548.96,5114,28.49,417.17,1711.13,14.94,6218,-0.16,9.31,22.33]
["ES",2014,"I55","1b",1,null,null,null,5594858,1792807,980854,92,19217,14.29,92,0.38,1.67,6.97,514.61,91,363.21,936.71,2962.43,25.78,92,15.19,22.4,30.98]
["ES",2014,"I56",0,1,33.36,null,51.69,10131438,12680878,5255965,22853,218862,9.49,14093,0,0,0.09,382.44,16746,-568.54,295.98,1453.45,4.9000000000000004,22524,-5.28,1.93,6.54]
["ES",2014,"I56",1,1,null,null,null,7505799,9872915,3920679,22830,165650,4.8099999999999996,14070,0,0,0.08,394.45,16724,-573.75,295.75,1452.26,3.69,22501,-5.29,1.92,6.54]
["ES",2014,"I56",2,1,null,null,null,2625639,2807963,1335286,23,53212,16.12,23,0.12,0.94,13.85,366.63,22,497.44,1355.22,30638.48,9.15,23,4.75,8.91,12.16]
["ES",2014,"I56","1a",1,null,null,null,7059792,9052760,3520108,22791,149239,5.0999999999999996,14032,0,0,0.08,353.93,16688,-578.92999999999995,293.73,1445.47,3.32,22462,-5.3,1.91,6.53]
["ES",2014,"I56","1b",1,null,null,null,446006,820154,400570,39,16411,3.44,38,null,null,null,860.66,36,null,null,null,7.74,39]
["ES",2014,"J",0,1,45.91,null,72.22,78373943,55328289,23228480,16273,254507,4.28,11391,0,0,0.52,1364.55,10255,-105.95,604.66,3927.43,20.09,16002,-2.68,5.37,17.2]
["ES",2014,"J",1,1,null,null,null,11572555,10261322,5209696,16179,119824,10.08,11308,0,0,0.49,901.84,10168,-114.72,600.41999999999996,3910.45,8.82,15908,-2.75,5.34,17.170000000000002]
["ES",2014,"J",2,1,null,null,null,66801388,45066966,18018784,94,134683,3.79,83,0.5,4.3,23.8,1429.94,87,298.97000000000003,1085.19,5496.54,22.66,94,3.92,9.33,26.13]
["ES",2014,"J","1a",1,null,null,null,7598108,6277176,3174948,15978,77272,8.64,11131,0,0,0.43,840.33,10000,-131.59,591.62,3876.76,8.2100000000000009,15707,-2.91,5.3,17.23]
["ES",2014,"J","1b",1,null,null,null,3974447,3984145,2034713,201,42552,12.05,177,0.16,2.0099999999999998,8.9499999999999993,999.27,168,362.04,1293.6600000000001,10226.81,9.7899999999999991,201,2.35,6.79,13.78]
["ES",2014,"J58",0,1,37.92,null,48.44,4511739,2834964,1037744,2323,17638,37.409999999999997,1524,0,0,0.56000000000000005,502.39,1478,-385.55,472.49,3195.66,10.28,2297,-6.51,4.3899999999999997,15.01]
["ES",2014,"J58",1,1,null,null,null,1991871,1438934,563852,2307,12480,20.36,1510,0,0,0.52,578.95000000000005,1462,-387.93,468.93,3195.66,6.8,2281,-6.74,4.37,15]
["ES",2014,"J58",2,1,null,null,null,2519867,1396029,473891,16,5158,46.08,14,7.69,19.66,52.44,471.34,16,214.24,641.33000000000004,2612.56,13.87,16,1.73,9.58,22.97]
["ES",2014,"J58","1a",1,null,null,null,1481388,969517,385345,2281,9493,15.78,1489,0,0,0.46,632.97,1440,-389.63,466.87,3179.66,6.16,2255,-7.02,4.3499999999999996,15.01]
["ES",2014,"J58","1b",1,null,null,null,510482,469417,178507,26,2987,27.57,21,0.37,5.67,32.950000000000003,510.91,22,208.2,1198.95,14348.42,8.1199999999999992,26,1.1499999999999999,6.47,10.7]
["ES",2014,"J59",0,1,35.81,null,34.92,3851477,3250743,600514,1904,11557,29.79,1339,0,0,0.28999999999999998,340.96,1167,-107.63,646.29,3828.56,6.06,1868,-3.74,8.2899999999999991,23.88]
["ES",2014,"J59",1,1,null,null,null,1427618,986113,442052,1898,8155,9.2799999999999994,1334,0,0,0.28000000000000003,1227.6400000000001,1162,-117.62,652.1,3888.73,13.08,1862,-3.81,8.2899999999999991,23.98]
["ES",2014,"J59",2,1,null,null,null,2423859,2264630,158462,6,3402,null,5,null,null,null,null,5,null,null,null,3.01,6,null,5.82]
["ES",2014,"J59","1a",1,null,null,null,1045251,646797,254580,1879,5515,8,1317,0,0,0.25,851.16,1146,-130.22999999999999,642.64,3776.75,10.61,1843,-3.93,8.14,23.77]
["ES",2014,"J59","1b",1,null,null,null,382366,339315,187472,19,2640,10.74,17,null,null,null,2472.35,16,null,null,null,17.77,19]
["ES",2014,"J60",0,1,28.8,null,30.74,3272578,1727081,607260,447,4165,15.95,269,0,0,1.33,2103.1799999999998,302,-1026.55,459.82,2699.69,26.67,437,-11.59,4.67,18.600000000000001]
["ES",2014,"J60",1,1,null,null,null,370342,220212,80062,444,2167,13.66,266,0,0,1.29,909.49,299,-1032.33,421.32,2699.44,6.27,434,-11.64,4.55,18.489999999999998]
["ES",2014,"J60",2,1,null,null,null,null,null,null,3,null,null,3,null,null,null,null,3,null,null,null,null,3]
["ES",2014,"J60","1a",1,null,null,null,261237,122374,60808,439,1871,17.52,262,0,0,1.29,598.35,294,-1034.3900000000001,403.83,2606.87,6.97,429,-11.66,4.43,18.600000000000001]
["ES",2014,"J60","1b",1,null,null,null,null,null,null,5,null,null,4,null,null,null,null,5,null,null,null,null,5]
["ES",2014,"J61",0,1,100,null,100,45639003,27337389,12081166,1416,58254,-0.6,953,0,0,0.41,1769.17,948,-271.11,625.16999999999996,3439.75,31.26,1388,-4.34,4.63,16.02]
["ES",2014,"J61",1,1,null,null,null,1301131,1202869,506587,1390,12148,7.37,928,0,0,0.35,1480.88,925,-311.57,607.36,3306.21,11.61,1362,-4.79,4.37,15.63]
["ES",2014,"J61",2,1,null,null,null,44337872,26134520,11574579,26,46106,-0.7,25,0.18,0.45,3.51,1775.56,23,622.5,1353.14,6238.83,32.18,26,8.8800000000000008,20.56,45.74]
["ES",2014,"J61","1a",1,null,null,null,596271,587060,252211,1356,7295,7.07,898,0,0,0.3,789.89,898,-322.58999999999997,586.46,3128,7.49,1328,-5.19,4.26,15.5]
["ES",2014,"J61","1b",1,null,null,null,null,null,null,34,null,null,30,null,null,null,null,27,null,null,null,null,34]
["ES",2014,"J62",0,1,50.19,null,76.8,15274397,15542861,7822106,8612,150521,17.66,6234,0,0,0.56000000000000005,746.5,5421,22.36,646.39,4137.1000000000004,5.66,8470,-0.87,5.28,16.239999999999998]
["ES",2014,"J62",1,1,null,null,null,5552664,5664059,3212648,8574,74305,9.6999999999999993,6202,0,0,0.53,806.23,5386,17.809999999999999,637.54,4124.68,7.8,8432,-0.9,5.27,16.27]
["ES",2014,"J62",2,1,null,null,null,9721733,9878802,4609458,38,76216,25.69,32,1.1499999999999999,5.14,25.34,694.67,35,249.24,2235.06,5786.88,4.4400000000000004,38,2.09,5.87,11.83]
["ES",2014,"J62","1a",1,null,null,null,3536142,3477517,1983735,8471,46912,6.87,6111,0,0,0.47,895.18,5300,5.68,632.59,4155.34,8.36,8329,-1,5.27,16.350000000000001]
["ES",2014,"J62","1b",1,null,null,null,2016523,2186542,1228912,103,27393,15.16,91,0.41,2.56,8.39,676.74,86,365.79,985.38,3566.86,6.9,103,2.5099999999999998,5.39,10.55]
["ES",2014,"J63",0,1,90.13,null,81.39,5824761,4635248,1079654,1571,12372,18.63,1072,0,0,0.56000000000000005,987.34,939,-306.89999999999998,608.17999999999995,4559.8999999999996,16.18,1542,-4.32,5.56,20.22]
["ES",2014,"J63",1,1,null,null,null,928941,749132,404458,1566,10569,7.3,1068,0,0,0.54,1175.4000000000001,934,-307.68,595.72,4548.29,11.38,1537,-4.32,5.53,20.21]
["ES",2014,"J63",2,1,null,null,null,null,null,null,5,null,null,4,null,null,null,null,5,null,null,null,null,5]
["ES",2014,"J63","1a",1,null,null,null,677831,473910,238267,1552,6186,12.06,1054,0,0,0.52,1008.91,922,-324.23,584.67999999999995,4518.3599999999997,9.33,1523,-4.49,5.34,20.21]
["ES",2014,"J63","1b",1,null,null,null,251109,275221,166191,14,4383,2.2799999999999998,14,null,null,null,1430.76,12,null,null,null,14.93,14]
["ES",2014,"K642",0,1,88.3,null,25.67,81583621,88115,72042,755,769,98.83,551,0.21,58.41,100.73,197.3,447,-0.21,366.98,4501.58,null,546]
["ES",2014,"L",0,1,39.18,null,50.52,116489502,7313971,4316697,38499,52828,24.47,29825,0,0,2.94,294.22000000000003,26746,94.03,526.28,2663.76,49.62,32609,4.04,38.46,74.400000000000006]
["ES",2014,"L",1,1,null,null,null,85732304,5432217,3790175,38475,48781,15.26,29806,0,0,2.93,519.17999999999995,26724,94.24,526.94000000000005,2666.95,51.09,32586,4.05,38.46,74.37]
["ES",2014,"L",2,1,null,null,null,30757198,1881754,526522,24,4047,54.4,19,11.76,26.78,65.14,122.17,22,20.88,164,384.96,45.37,23,1.34,44.65,105.82]
["ES",2014,"L","1a",1,null,null,null,75998147,4630853,3319205,38388,46097,15.06,29727,0,0,2.9,590.52,26644,93.82,527.09,2677.55,50.75,32503,4.01,38.380000000000003,74.33]
["ES",2014,"L","1b",1,null,null,null,9734157,801364,470969,87,2684,16.36,79,0.62,4.03,26.32,311.24,80,195.31,491.43,1510.61,53.03,83,35.5,67.31,89.45]
["ES",2014,"L68",0,1,39.18,null,50.52,116489502,7313971,4316697,38499,52828,24.47,29825,0,0,2.94,294.22000000000003,26746,94.03,526.28,2663.76,49.62,32609,4.04,38.46,74.400000000000006]
["ES",2014,"L68",1,1,null,null,null,85732304,5432217,3790175,38475,48781,15.26,29806,0,0,2.93,519.17999999999995,26724,94.24,526.94000000000005,2666.95,51.09,32586,4.05,38.46,74.37]
["ES",2014,"L68",2,1,null,null,null,30757198,1881754,526522,24,4047,54.4,19,11.76,26.78,65.14,122.17,22,20.88,164,384.96,45.37,23,1.34,44.65,105.82]
["ES",2014,"L68","1a",1,null,null,null,75998147,4630853,3319205,38388,46097,15.06,29727,0,0,2.9,590.52,26644,93.82,527.09,2677.55,50.75,32503,4.01,38.380000000000003,74.33]
["ES",2014,"L68","1b",1,null,null,null,9734157,801364,470969,87,2684,16.36,79,0.62,4.03,26.32,311.24,80,195.31,491.43,1510.61,53.03,83,35.5,67.31,89.45]
["ES",2014,"M",0,1,43.83,null,61.58,441737221,29073308,15282765,59822,322551,91.91,43364,0,0,1.02,308.75,37605,-3.87,666.87,3999.84,85.3,58383,-0.84,6.91,21.13]
["ES",2014,"M69",0,1,41.6,null,54.49,9691058,6148081,3164258,19675,73237,16.64,15151,0,0,1.1499999999999999,910.7,12335,136.22,794.4,4108.47,10.57,19479,0.56999999999999995,6.71,17.559999999999999]
["ES",2014,"M69",1,1,null,null,null,8604681,4432898,2398834,19663,62428,18.27,15139,0,0,1.1499999999999999,920.97,12323,135.87,792.86,4109.79,11.37,19467,0.56000000000000005,6.71,17.57]
["ES",2014,"M69",2,1,null,null,null,null,null,null,12,null,null,12,null,null,null,null,12,null,null,null,null,12]
["ES",2014,"M69","1a",1,null,null,null,7186275,3900237,2149472,19629,58287,17.88,15108,0,0,1.1499999999999999,1180.6199999999999,12293,135.29,793.59,4104.99,11.7,19433,0.55000000000000004,6.71,17.57]
["ES",2014,"M69","1b",1,null,null,null,1418405,532661,249362,34,4141,22.18,31,null,null,null,297.04000000000002,30,null,null,null,8.9600000000000009,34]
["ES",2014,"M70",0,1,64.97,null,73.010000000000005,395418353,2783859,3358085,9379,57786,101.96,6878,0,0,4.1500000000000004,287.33999999999997,5592,30.95,721.41,5062.2,783.59,8817,-0.16,10.07,34.76]
["ES",2014,"M701",0,1,67.64,null,97.41,384116853,240016,1992766,1158,29516,103.1,892,0.05,40.409999999999997,105.82,286.05,738,67.56,736.04,6202.85,null,848]
["ES",2014,"M702",0,1,64.61,null,57.88,11301500,2543843,1365318,8221,28270,45.54,5986,0,0,1.49,372.88,4854,21.69,715.16,4931.84,16.96,7969,-0.64,9.27,30.83]
["ES",2014,"M702",1,1,null,null,null,7814659,2000419,1035545,8213,21655,34.93,5978,0,0,1.49,779.52,4847,20.22,714.3,4920.84,16.239999999999998,7961,-0.65,9.27,30.83]
["ES",2014,"M702",2,1,null,null,null,null,null,null,8,null,null,8,null,null,null,null,7,null,null,null,null,8]
["ES",2014,"M702","1a",1,null,null,null,6168072,1680349,879758,8187,19197,32.28,5955,0,0,1.43,1065.75,4826,19.27,717.52,4931.84,16.97,7936,-0.67,9.27,30.8]
["ES",2014,"M702","1b",1,null,null,null,1646586,320069,155787,26,2458,53.97,23,null,null,null,265.83,21,null,null,null,12.38,25]
["ES",2014,"M71",0,1,28.98,null,52.34,21192443,9835484,4236551,12026,81657,31.27,8112,0,0,0.81,440.57,7889,-235.81,514.54999999999995,3250.8,11.75,11790,-6.05,6.55,21.67]
["ES",2014,"M71",1,1,null,null,null,6769654,4197909,2030799,11995,46102,19.04,8083,0,0,0.78,714.44,7861,-239.02,512.34,3233.57,9.32,11760,-6.08,6.54,21.67]
["ES",2014,"M71",2,1,null,null,null,14422789,5637575,2205752,31,35555,37.53,29,7.64,14.46,26.13,368.28,28,379.42,3003.82,9454.7900000000009,13.55,30,6.3,10.97,20.68]
["ES",2014,"M71","1a",1,null,null,null,5383492,2990906,1441670,11937,34053,14.65,8032,0,0,0.72,647.73,7809,-246.04,508.04,3211.7,8.77,11702,-6.19,6.51,21.71]
["ES",2014,"M71","1b",1,null,null,null,1386162,1207002,589128,58,12049,27.96,51,0.61,5.73,17.64,903.92,52,392.27,993.57,5045.13,10.69,58,3.28,8.52,15.69]
["ES",2014,"M72",0,1,42.19,null,68.260000000000005,2242678,978328,543392,913,8711,6.58,586,0,0.01,1.07,584.39,579,-430.05,552.1,4095.69,10.48,862,-9.4,7.64,28.08]
["ES",2014,"M72",1,1,null,null,null,1614718,461052,295839,909,5803,8.66,582,0,0.01,1.06,531.9,575,-436.47,552.1,4095.69,12.15,858,-9.4499999999999993,7.66,28.21]
["ES",2014,"M72",2,1,null,null,null,null,null,null,4,null,null,4,null,null,null,null,4,null,null,null,null,4]
["ES",2014,"M72","1a",1,null,null,null,816786,327950,215051,901,4774,12.01,575,0,0,1.01,471.45,568,-440.12,545.45000000000005,4056.59,10.42,850,-9.84,7.64,28.27]
["ES",2014,"M72","1b",1,null,null,null,797932,133102,80788,8,1029,3.46,7,null,null,null,665.47,7,null,null,null,16.420000000000002,8]
["ES",2014,"M73",0,1,22.76,null,46.49,4063562,4598407,1527231,5474,46247,10.55,3867,0,0,0.47,1396.56,3535,-113.01,609.76,4293.84,7.06,5375,-1.85,5.14,16.93]
["ES",2014,"M73",1,1,null,null,null,2861382,2832568,1039723,5463,29052,14.47,3857,0,0,0.45,1076.1600000000001,3525,-116.96,604.62,4291.04,6.82,5364,-1.88,5.15,16.940000000000001]
["ES",2014,"M73",2,1,null,null,null,1202180,1765838,487508,11,17195,4.8099999999999996,10,null,2.54,null,2483.4899999999998,10,null,3746.98,null,7.44,11,null,2.4300000000000002]
["ES",2014,"M73","1a",1,null,null,null,2294894,2017746,774070,5427,21063,14.76,3825,0,0,0.42,879.26,3502,-120.74,603.12,4251.75,7.13,5328,-2.0699999999999998,5.17,17.059999999999999]
["ES",2014,"M73","1b",1,null,null,null,566487,814822,265652,36,7989,13.98,32,null,null,null,3108.75,23,null,null,null,6.08,36]
["ES",2014,"M74",0,1,100,null,100,8924142,4496951,2356597,11395,51349,12.55,8077,0,0,0.46,1247.07,6944,-81.680000000000007,627.77,3953.65,17.78,11106,-1.9,7,23.38]
["ES",2014,"M74",1,1,null,null,null,7620289,3874990,1916910,11385,46446,12.6,8067,0,0,0.46,1277.6099999999999,6937,-83.33,627.77,3964.27,14.23,11096,-1.91,6.99,23.39]
["ES",2014,"M74",2,1,null,null,null,1303853,621961,439687,10,4903,12.43,10,null,1.32,null,1184.25,7,null,650.76,null,39.92,10,null,10.6]
["ES",2014,"M74","1a",1,null,null,null,6352724,2765556,1313233,11330,33349,17.93,8020,0,0,0.45,931.29,6889,-83.85,622.79,3953.53,12.28,11041,-1.96,7,23.43]
["ES",2014,"M74","1b",1,null,null,null,1267565,1109434,603676,55,13097,4.04,47,7.0000000000000007E-2,1.44,7.59,3172.7,48,538.97,1196.75,4979.62,19.07,55,2.08,6.47,15.54]
["ES",2014,"M75",0,1,60.95,null,67.41,205155,232195,96649,960,3564,2.34,693,0,0,0.1,587.66999999999996,731,-67.03,549.9,2388.4699999999998,5.39,954,-1.1200000000000001,4.3099999999999996,10.33]
["ES",2014,"M75",1,1,null,null,null,205155,232195,96649,960,3564,2.34,693,0,0,0.1,587.66999999999996,731,-67.03,549.9,2388.4699999999998,5.39,954,-1.1200000000000001,4.3099999999999996,10.33]
["ES",2014,"M75",2,1,null,null,null,null,null,null,0,null,null,0,null,null,null,null,0,null,null,null,null,0]
["ES",2014,"M75","1a",1,null,null,null,205155,232195,96649,960,3564,2.34,693,0,0,0.1,587.66999999999996,731,-67.03,549.9,2388.4699999999998,5.39,954,-1.1200000000000001,4.3099999999999996,10.33]
["ES",2014,"M75","1b",1,null,null,null,null,null,null,0,null,null,0,null,null,null,null,0,null,null,null,null,0]
["ES",2014,"MC",0,1,43.52,null,59.38,57620368,28833292,13289999,58664,293035,22.46,42472,0,0,0.87,618.55999999999995,36867,-6.73,665.65,3975.15,11.93,57535,-0.89,6.81,20.63]
["ES",2014,"MC",1,1,null,null,null,35490368,18032034,8814301,58588,215050,18.68,42399,0,0,0.86,902.35,36799,-8.1,663.52,3966.34,11.26,57460,-0.91,6.81,20.64]
["ES",2014,"MC",2,1,null,null,null,22129999,10801257,4475697,76,77985,29.42,73,0.48,3.55,16.489999999999998,435.11,68,461.24,1956.9,5514.13,13.35,75,4.99,8.32,16.03]
["ES",2014,"MC","1a",1,null,null,null,28407229,13914941,6869905,58371,174287,19.46,42208,0,0,0.83,912.37,36618,-11.02,661.93,3955.13,11.02,57244,-0.94,6.81,20.67]
["ES",2014,"MC","1b",1,null,null,null,7083139,4117092,1944395,217,40763,16.309999999999999,191,0.2,3.59,17.559999999999999,873.01,181,337.53,1012.12,5378.65,12.04,216,2.4900000000000002,6.65,15.42]
["ES",2014,"N",0,1,22.09,null,60.43,32149332,30923550,17686027,20045,658796,11.75,14177,0,0,0.74,749.28,13711,-63.8,477.75,2422.54,9.51,19503,-1.71,4.83,17.09]
["ES",2014,"N",1,1,null,null,null,17568590,12406256,7030757,19955,289630,21.89,14096,0,0,0.71,583.13,13627,-67.17,475,2424.77,8.09,19413,-1.77,4.83,17.11]
["ES",2014,"N",2,1,null,null,null,14580742,18517293,10655270,90,369166,6.98,81,0.45,2.08,12.24,883.52,84,231.28,908.25,2001.12,10.51,90,1.87,4.62,9.0399999999999991]
["ES",2014,"N","1a",1,null,null,null,13150601,8093893,4213349,19750,161526,16.579999999999998,13917,0,0,0.65,644.34,13450,-73.58,474.72,2432.5100000000002,8.4600000000000009,19208,-1.9,4.8600000000000003,17.18]
["ES",2014,"N","1b",1,null,null,null,4417988,4312363,2817408,205,128104,33.340000000000003,179,0.27,2.2400000000000002,14.63,484.65,177,187.81,491.98,1885.71,7.4,205,1.32,3.36,11.12]
["ES",2014,"N77",0,1,22.96,null,44.17,9196084,3640277,1911425,3556,18522,4.92,2514,0,0,0.39,822.12,2687,-58.15,513.45000000000005,2066.0500000000002,37.39,3423,-3.49,11.56,30.86]
["ES",2014,"N77",1,1,null,null,null,4456491,1651620,738636,3545,14077,14.65,2503,0,0,0.38,560.30999999999995,2676,-59.53,509.84,2072.9499999999998,21.95,3412,-3.54,11.48,30.73]
["ES",2014,"N77",2,1,null,null,null,4739593,1988657,1172789,11,4445,1.4,11,null,0.54,null,990.25,11,null,990.61,null,50.21,11,null,54.14]
["ES",2014,"N77","1a",1,null,null,null,3292760,1329419,609310,3529,12935,6.44,2487,0,0,0.36,663.49,2661,-63.73,506.27,2108.63,18.36,3396,-3.69,11.31,30.69]
["ES",2014,"N77","1b",1,null,null,null,null,null,null,16,null,null,16,null,null,null,null,15,null,null,null,null,16]
["ES",2014,"N78",0,1,21.93,null,71.8,1227994,3191506,2947589,550,138529,3,421,0,0.01,1.74,839.38,366,112.56,514.14,2462.52,3.06,541,0.43,3.93,14.52]
["ES",2014,"N78",1,1,null,null,null,456531,1038911,913590,539,47960,3.73,410,0,0,1.53,473.13,355,83.28,498.87,2449.5100000000002,3.16,530,0.34,4.0599999999999996,14.64]
["ES",2014,"N78",2,1,null,null,null,771463,2152595,2033999,11,90569,2.63,11,null,0.88,null,1378.32,11,null,1616.17,null,3.02,11,null,2.73]
["ES",2014,"N78","1a",1,null,null,null,222771,340890,263986,512,11210,5.9,386,0,0,1.51,667.27,329,65.8,508.38,2698.73,5.18,503,0.2,4.3899999999999997,15.22]
["ES",2014,"N78","1b",1,null,null,null,233760,698021,649604,27,36750,1.2,24,null,null,null,353.11,26,null,null,null,2.17,27]
["ES",2014,"N79",0,1,40.28,null,55.83,2911748,7660479,952497,2792,22442,34.99,1935,0,0.01,1.49,1010.16,1852,-94.88,332.4,1678.63,4,2705,-1.62,2.08,9.14]
["ES",2014,"N79",1,1,null,null,null,1023808,2272855,332035,2778,9826,58.75,1923,0,0,1.47,632.42999999999995,1840,-96.35,328.55,1669.93,3.16,2691,-1.69,2.08,9.11]
["ES",2014,"N79",2,1,null,null,null,1887940,5387624,620461,14,12616,27.7,12,0.91,15.04,33.31,1236.78,12,197.76,684.53,2194.67,4.3499999999999996,14,0.9,2.09,8.83]
["ES",2014,"N79","1a",1,null,null,null,829614,1606867,277047,2746,7916,9.34,1898,0,0,1.34,517.19000000000005,1815,-95.6,324.47000000000003,1647.08,2.82,2659,-1.73,2.09,9.2100000000000009]
["ES",2014,"N79","1b",1,null,null,null,194193,665988,54987,32,1910,142.72999999999999,25,null,null,null,1017.96,25,null,null,null,4,32]
["ES",2014,"N80",0,1,43.08,null,77.98,2101501,3318676,2573856,738,86538,4.68,543,0,0.01,0.74,775.78,558,31.99,388.18,2107.9699999999998,7.52,728,-0.09,4,10.039999999999999]
["ES",2014,"N80",1,1,null,null,null,651395,898963,656532,726,24861,15.84,535,0,0.01,0.71,337.98,547,39.869999999999997,392.55,2120.2199999999998,3.21,716,-7.0000000000000007E-2,4,10.08]
["ES",2014,"N80",2,1,null,null,null,1450106,2419713,1917324,12,61677,3.21,8,null,8.89,null,934.33,11,null,48.74,null,9.1199999999999992,12,-0.27,2.78,6.45]
["ES",2014,"N80","1a",1,null,null,null,410869,468860,306167,708,11689,7.69,520,0,0,0.66,406.15,530,38.06,404.09,2198.1999999999998,4.6399999999999997,698,-0.12,4.09,10.23]
["ES",2014,"N80","1b",1,null,null,null,240525,430103,350364,18,13172,40.65,15,null,null,null,223.72,17,null,null,null,1.66,18]
["ES",2014,"N81",0,1,34.75,null,62.77,5345017,7446826,5987920,5079,282666,7.88,3539,0,0,0.27,618.11,3715,-147.96,440.38,2111.35,5.12,5034,-2.11,3.54,9.94]
["ES",2014,"N81",1,1,null,null,null,2522151,3309143,2535263,5061,131053,9,3523,0,0,0.26,532.5,3697,-151.79,438.95,2122.11,4.53,5016,-2.14,3.53,10.039999999999999]
["ES",2014,"N81",2,1,null,null,null,2822866,4137683,3452657,18,151613,7.16,16,2.3199999999999998,7.25,14.58,690.21,18,351.66,556.04999999999995,1492.88,5.58,18,2.38,4.5199999999999996,5.37]
["ES",2014,"N81","1a",1,null,null,null,1790763,2212479,1637426,5009,81054,7.07,3477,0,0,0.22,520.47,3649,-167.01,438.95,2144.58,4.6399999999999997,4964,-2.25,3.56,10.07]
["ES",2014,"N81","1b",1,null,null,null,731388,1096664,897837,52,49999,13.16,46,1.72,5.77,18.579999999999998,560.49,48,212.16,463.55,1825.07,4.33,52,1.1000000000000001,2.4300000000000002,6.88]
["ES",2014,"N82",0,1,14.81,null,43.37,11366991,5665783,3312727,7330,110099,24.71,5225,0,0,1.24,609.6,4533,-34.11,597.38,3619.5,9.81,7072,-1.36,6.74,23.72]
["ES",2014,"N82",1,1,null,null,null,8458218,3234761,1854688,7306,61853,29.54,5202,0,0,1.23,683.9,4512,-39.22,595.87,3586.82,11.06,7048,-1.43,6.76,23.79]
["ES",2014,"N82",2,1,null,null,null,2908773,2431021,1458039,24,48246,15.98,23,0.18,0.99,6.8,509.54,21,637.96,1691.52,5543.8,8.14,24,3.41,5.53,8.5299999999999994]
["ES",2014,"N82","1a",1,null,null,null,6603827,2135377,1119399,7246,36722,33.020000000000003,5149,0,0,1.19,767.6,4466,-48.31,594.26,3583.97,11.86,6988,-1.5,6.76,23.8]
["ES",2014,"N82","1b",1,null,null,null,1854390,1099384,735288,60,25131,21.29,53,0.08,1.18,16.61,542.33000000000004,46,160.38999999999999,872.86,5028.2299999999996,9.5299999999999994,60,2.2799999999999998,6.79,20.56]
["ES",2014,"P",0,1,30.34,null,33.07,4367413,3365744,2290754,8509,73807,7.91,5744,0,0,0.18,1020.68,5471,-354.66,446.61,2554.0100000000002,11.85,8383,-4.1500000000000004,4.63,13.9]
["ES",2014,"P",1,1,null,null,null,3640487,3029453,2084694,8506,71072,6.3,5741,0,0,0.18,820.97,5468,-355.34,446.45,2546.39,9.3699999999999992,8380,-4.16,4.63,13.88]
["ES",2014,"P",2,1,null,null,null,null,null,null,3,null,null,3,null,null,null,null,3,null,null,null,null,3]
["ES",2014,"P","1a",1,null,null,null,2925942,2501128,1722212,8477,61112,6.64,5714,0,0,0.17,878.66,5445,-363.43,443.63,2535.0700000000002,8.91,8351,-4.1900000000000004,4.62,13.86]
["ES",2014,"P","1b",1,null,null,null,714544,528325,362481,29,9960,5.07,27,null,null,null,662.27,23,null,null,null,11.56,29]
["ES",2014,"P85",0,1,30.34,null,33.07,4367413,3365744,2290754,8509,73807,7.91,5744,0,0,0.18,1020.68,5471,-354.66,446.61,2554.0100000000002,11.85,8383,-4.1500000000000004,4.63,13.9]
["ES",2014,"P85",1,1,null,null,null,3640487,3029453,2084694,8506,71072,6.3,5741,0,0,0.18,820.97,5468,-355.34,446.45,2546.39,9.3699999999999992,8380,-4.16,4.63,13.88]
["ES",2014,"P85",2,1,null,null,null,null,null,null,3,null,null,3,null,null,null,null,3,null,null,null,null,3]
["ES",2014,"P85","1a",1,null,null,null,2925942,2501128,1722212,8477,61112,6.64,5714,0,0,0.17,878.66,5445,-363.43,443.63,2535.0700000000002,8.91,8351,-4.1900000000000004,4.62,13.86]
["ES",2014,"P85","1b",1,null,null,null,714544,528325,362481,29,9960,5.07,27,null,null,null,662.27,23,null,null,null,11.56,29]
["ES",2014,"Q",0,1,50.15,null,58.94,16135317,12567573,6959848,14493,201491,8.1999999999999993,11763,0,0,0.31,508.43,9934,230.34,1013.02,4737.3900000000003,13.46,14367,2.0099999999999998,8.73,19.12]
["ES",2014,"Q",1,1,null,null,null,9198760,8302833,4579501,14459,141048,5.35,11730,0,0,0.3,985.49,9900,230.75,1015.11,4750.9799999999996,12.22,14333,1.99,8.73,19.13]
["ES",2014,"Q",2,1,null,null,null,6936557,4264740,2380347,34,60443,12.47,33,0.41,3.34,15.42,294.72000000000003,34,191.61,401.53,1914.04,15.88,34,6.35,8.92,15.81]
["ES",2014,"Q","1a",1,null,null,null,6489276,5895036,3120173,14352,97472,4.67,11624,0,0,0.28000000000000003,1023.53,9800,227.18,1012.07,4752.68,11.93,14226,1.95,8.69,19.13]
["ES",2014,"Q","1b",1,null,null,null,2709483,2407796,1459328,107,43576,6.89,106,0.17,1.86,6.23,909.01,100,571.89,1269.5999999999999,3865.81,12.91,107,7,11.5,18.260000000000002]
["ES",2014,"Q86",0,1,51.81,null,60.35,10034397,9275834,4573840,12410,107718,7.8,10180,0,0,0.28000000000000003,622.57000000000005,8261,271.63,1140.93,5413.9,13.19,12306,2.2599999999999998,9.24,20.059999999999999]
["ES",2014,"Q86",1,1,null,null,null,6575074,6209003,3033651,12384,75030,5.84,10155,0,0,0.28000000000000003,1308.58,8235,272.86,1144.83,5432.91,12.82,12280,2.2599999999999998,9.24,20.07]
["ES",2014,"Q86",2,1,null,null,null,3459323,3066831,1540189,26,32688,11.46,25,0.26,2.0499999999999998,10.85,315.2,26,160.66,469.1,1340.97,13.95,26,5.32,9.0399999999999991,15.81]
["ES",2014,"Q86","1a",1,null,null,null,4702667,4443900,2074979,12308,52742,5.09,10079,0,0,0.26,1310.18,8166,267.91000000000003,1135.52,5444.92,12.58,12204,2.2200000000000002,9.2100000000000009,20.09]
["ES",2014,"Q86","1b",1,null,null,null,1872406,1765102,958671,76,22288,7.59,76,0.16,1.49,5.54,1304.81,69,870.11,1576.79,4895.87,13.41,76,8.18,11.45,17.64]
["ES",2014,"Q87",0,1,43.3,null,67.25,5527753,2684684,1900353,1283,69414,9.67,1032,0,0.01,0.56000000000000005,331.9,1085,163.6,587.13,2049.6799999999998,16,1274,1.92,7.71,15.71]
["ES",2014,"Q87",1,1,null,null,null,2138039,1562985,1102637,1276,43150,3.38,1025,0,0.01,0.54,528.32000000000005,1078,161.72999999999999,589.79999999999995,2045.03,11.97,1267,1.9,7.61,15.71]
["ES",2014,"Q87",2,1,null,null,null,3389714,1121699,797716,7,26264,14.53,7,null,8.99,null,257.91000000000003,7,null,345.01,null,21.61,7,null,8.7899999999999991]
["ES",2014,"Q87","1a",1,null,null,null,1563952,1150454,803099,1257,31849,2.63,1007,0,0.01,0.5,563.13,1059,159.04,590.29,2100.77,11.39,1248,1.85,7.44,15.61]
["ES",2014,"Q87","1b",1,null,null,null,574087,412530,299538,19,11301,5.12,18,null,null,null,461.52,19,null,null,null,13.57,19]
["ES",2014,"Q88",0,1,40.299999999999997,null,40.479999999999997,573166,607054,485654,800,24359,4.32,551,0,0,0.17,569.07000000000005,588,-142.19999999999999,375.63,1756.26,6.31,787,-2.23,3.64,10.4]
["ES",2014,"Q88",1,1,null,null,null,485646,530844,443212,799,22868,4.68,550,0,0,0.17,468.62,587,-144.69,370.28,1744.21,5.91,786,-2.25,3.64,10.4]
["ES",2014,"Q88",2,1,null,null,null,null,null,null,1,null,null,1,null,null,null,null,1,null,null,null,null,1]
["ES",2014,"Q88","1a",1,null,null,null,222656,300681,242094,787,12881,6.76,538,0,0,0.11,477.98,575,-165.28,362.28,1766.55,4.42,774,-2.29,3.63,10.4]
["ES",2014,"Q88","1b",1,null,null,null,262989,230163,201117,12,9987,3.14,12,null,null,null,461.98,12,null,null,null,7.86,12]
["ES",2014,"R",0,1,33.26,null,27.42,7643181,5065351,1775739,9344,48979,9.43,6022,0,0,0.23,635.02,6488,-410.22,413.07,2713.02,11.11,9109,-7.87,5.14,16.350000000000001]
["ES",2014,"R",1,1,null,null,null,6425381,4371969,1504651,9337,44838,7.98,6015,0,0,0.23,645.20000000000005,6481,-411.99,411.95,2710.8,9.7899999999999991,9102,-7.9,5.12,16.309999999999999]
["ES",2014,"R",2,1,null,null,null,1217799,693382,271088,7,4141,14.02,7,null,9.89,null,604.72,7,null,2685.57,null,19.440000000000001,7,null,19.149999999999999]
["ES",2014,"R","1a",1,null,null,null,5284101,3322626,1236409,9274,39200,6.91,5962,0,0,0.2,583.98,6425,-421.49,406.01,2670.97,9.36,9039,-8.19,5.09,16.3]
["ES",2014,"R","1b",1,null,null,null,1141280,1049342,268242,63,5638,10.82,53,0.24,1.82,6.15,894.3,56,414.84,1680.49,9374.2000000000007,11.15,63,2.5499999999999998,8.66,19.64]
["ES",2014,"R90",0,1,28.37,null,14.21,684747,524258,164646,1905,5693,11.45,1185,0,0,0.13,490.56,1192,-504.68,427.06,3194.02,4.8,1868,-9.14,3.97,16.68]
["ES",2014,"R90",1,1,null,null,null,684747,524258,164646,1905,5693,11.45,1185,0,0,0.13,490.56,1192,-504.68,427.06,3194.02,4.8,1868,-9.14,3.97,16.68]
["ES",2014,"R90",2,1,null,null,null,null,null,null,0,null,null,0,null,null,null,null,0,null,null,null,null,0]
["ES",2014,"R90","1a",1,null,null,null,627092,463753,156306,1901,5409,11.35,1182,0,0,0.13,535.25,1188,-511.53,427.06,3194.02,5.24,1864,-9.17,3.97,16.71]
["ES",2014,"R90","1b",1,null,null,null,null,null,null,4,null,null,3,null,null,null,null,4,null,null,null,null,4]
["ES",2014,"R91",0,1,13.61,null,18.2,154754,89804,43205,213,1442,3.14,137,0,0,0.14000000000000001,502.06,142,-662.4,275.79000000000002,2120.3000000000002,10.44,208,-5.07,4.38,13.45]
["ES",2014,"R91",1,1,null,null,null,154754,89804,43205,213,1442,3.14,137,0,0,0.14000000000000001,502.06,142,-662.4,275.79000000000002,2120.3000000000002,10.44,208,-5.07,4.38,13.45]
["ES",2014,"R91",2,1,null,null,null,null,null,null,0,null,null,0,null,null,null,null,0,null,null,null,null,0]
["ES",2014,"R91","1a",1,null,null,null,141875,77103,35894,212,1302,4.75,136,0,0,0.15,355.94,141,-713.67,267.76,1792.77,8.0399999999999991,207,-5.0999999999999996,4.37,13.28]
["ES",2014,"R91","1b",1,null,null,null,null,null,null,1,null,null,1,null,null,null,null,1,null,null,null,null,1]
["ES",2014,"R92",0,1,49.03,null,51.41,2238963,2387881,631980,2301,13505,8.75,1859,0,0,0.55000000000000004,1145.32,1674,246.99,1218.79,5648.65,11.96,2195,2.86,10.19,21.21]
["ES",2014,"R92",1,1,null,null,null,2020541,2109699,579472,2298,12731,7.72,1856,0,0,0.55000000000000004,1139.04,1671,246.76,1218.1199999999999,5669.98,11.92,2192,2.84,10.19,21.22]
["ES",2014,"R92",2,1,null,null,null,null,null,null,3,null,null,3,null,null,null,null,3,null,null,null,null,3]
["ES",2014,"R92","1a",1,null,null,null,1497081,1375876,413177,2255,9540,6.54,1818,0,0,0.45,1067.97,1633,235.48,1197.67,5577.42,12.19,2149,2.89,10.19,21.26]
["ES",2014,"R92","1b",1,null,null,null,523459,733822,166295,43,3191,10.07,38,0.13,1.83,7.56,1313.81,38,631.08000000000004,3759.85,11281.59,11.43,43,2.77,8.66,15.57]
["ES",2014,"R93",0,1,32.57,null,27.16,4564717,2063406,935907,4925,28339,10.31,2841,0,0,0.15,428.25,3480,-861.15,203.91,1499.29,11.76,4838,-15.07,2.77,13.49]
["ES",2014,"R93",1,1,null,null,null,3565339,1648206,717327,4921,24972,8.23,2837,0,0,0.15,381.12,3476,-862.76,203.36,1493.22,8.61,4834,-15.08,2.75,13.47]
["ES",2014,"R93",2,1,null,null,null,null,null,null,4,null,null,4,null,null,null,null,4,null,null,null,null,4]
["ES",2014,"R93","1a",1,null,null,null,3018053,1405892,631031,4906,22949,6.72,2826,0,0,0.14000000000000001,360.95,3463,-866.1,202.51,1490.98,8.02,4819,-15.18,2.7,13.43]
["ES",2014,"R93","1b",1,null,null,null,547286,242313,86296,15,2023,14.08,11,null,null,null,486.44,13,null,null,null,12.02,15]
["ES",2014,"S",0,1,40.96,null,59.3,4408005,3368416,1648365,10048,59837,12.53,5534,0,0,0.15,743.18,6829,-1499.54,210.13,1451.37,8.7200000000000006,9864,-16.440000000000001,1.46,10.29]
["ES",2014,"S",1,1,null,null,null,3828087,2709412,1414880,10042,54918,11.12,5528,0,0,0.14000000000000001,663.94,6823,-1504.61,209.28,1444.23,8.32,9858,-16.45,1.44,10.27]
["ES",2014,"S",2,1,null,null,null,579917,659004,233484,6,4919,17.329999999999998,6,null,4.4400000000000004,null,1228.9100000000001,6,null,8504.9500000000007,null,10.38,6,null,16.07]
["ES",2014,"S","1a",1,null,null,null,3244825,2298933,1170813,10022,49500,9.66,5509,0,0,0.13,564.29,6808,-1509.71,206.14,1433.26,7.05,9838,-16.48,1.42,10.24]
["ES",2014,"S","1b",1,null,null,null,583262,410479,244067,20,5418,14.87,19,null,null,null,1208.6099999999999,15,null,null,null,15.47,20]
["ES",2014,"S94",0,1,null,null,null,null,null,null,0,null,null,0,null,null,null,null,0,null,null,null,null,0]
["ES",2014,"S94",1,1,null,null,null,null,null,null,0,null,null,0,null,null,null,null,0,null,null,null,null,0]
["ES",2014,"S94",2,1,null,null,null,null,null,null,0,null,null,0,null,null,null,null,0,null,null,null,null,0]
["ES",2014,"S94","1a",1,null,null,null,null,null,null,0,null,null,0,null,null,null,null,0,null,null,null,null,0]
["ES",2014,"S94","1b",1,null,null,null,null,null,null,0,null,null,0,null,null,null,null,0,null,null,null,null,0]
["ES",2014,"S95",0,1,17.96,null,30.95,573821,851578,352202,1383,9140,16.11,897,0,0,0.1,1527.33,964,-535.54999999999995,384.58,1995.28,5.66,1371,-4.97,2.6,7.7]
["ES",2014,"S95",1,1,null,null,null,357530,498031,233363,1381,7176,7.15,895,0,0,0.1,865.21,962,-542.01,383.79,1977.61,5.29,1369,-4.97,2.6,7.7]
["ES",2014,"S95",2,1,null,null,null,null,null,null,2,null,null,2,null,null,null,null,2,null,null,null,null,2]
["ES",2014,"S95","1a",1,null,null,null,315600,390515,163968,1377,5418,3.92,891,0,0,0.1,577.82000000000005,958,-548.05999999999995,382.62,1951.72,4.3600000000000003,1365,-5.0599999999999996,2.58,7.66]
["ES",2014,"S95","1b",1,null,null,null,null,null,null,4,null,null,4,null,null,null,null,4,null,null,null,null,4]
["ES",2014,"S96",0,1,51.48,null,71.040000000000006,3834187,2516838,1296162,8665,50697,11.83,4637,0,0,0.15,675.21,5865,-1669.81,175.46,1348.21,9.76,8493,-18.91,1.1599999999999999,10.77]
["ES",2014,"S96",1,1,null,null,null,3470560,2211380,1181517,8661,47742,11.65,4633,0,0,0.15,644.12,5861,-1670.24,174.89,1343.64,9.01,8489,-18.91,1.1499999999999999,10.75]
["ES",2014,"S96",2,1,null,null,null,null,null,null,4,null,null,4,null,null,null,null,4,null,null,null,null,4]
["ES",2014,"S96","1a",1,null,null,null,2929227,1908417,1006844,8645,44082,10.33,4618,0,0,0.14000000000000001,562.74,5850,-1677.12,174.42,1341.52,7.6,8473,-19.05,1.1200000000000001,10.7]
["ES",2014,"S96","1b",1,null,null,null,541333,302963,174672,16,3660,15.18,15,null,null,null,1050.99,11,null,null,null,17.88,16]
["ES",2014,"Z0",0,1,39.17,null,61.06,1821985408,1028327647,247914621,483864,5024571,31.73,343670,0,0,0.77,505.31,354928,-51.91,409.35,2032.4,11.53,468909,-1.61,4.37,14.83]
["ES",2014,"ZC",0,1,39.130000000000003,null,60.93,1437868555,1028087630,245921854,482706,4995055,16.03,342778,0,0,0.76,607.80999999999995,354190,-52.35,408.83,2028.89,9.4499999999999993,468061,-1.62,4.3600000000000003,14.77]
["ES",2014,"ZC",1,1,null,null,null,507733761,356161751,109203833,480914,2961459,10.220000000000001,341123,0,0,0.73,550.44000000000005,352508,-55.77,406.42,2018.97,7.66,466274,-1.67,4.3499999999999996,14.78]
["ES",2014,"ZC",2,1,null,null,null,930135291,671925879,136717999,1792,2033596,18.3,1655,0.47,3.25,15.28,633.6,1682,348.34,1083.48,4446.3900000000003,10.4,1787,2.88,6.93,13.87]
["ES",2014,"ZC","1a",1,null,null,null,375479417,237180810,76937103,474987,2260268,9.9700000000000006,335625,0,0,0.66,518.89,347076,-67.89,400,1996.51,7.15,460359,-1.84,4.33,14.86]
["ES",2014,"ZC","1b",1,null,null,null,132254599,118980941,32266729,5927,701191,10.63,5498,0.24,1.96,7.71,611.32000000000005,5432,312.52,837.32,3480.35,8.6999999999999993,5915,2.27,5.38,11.38]
["ES",2013,"A",0,-1,null,null,null,18659255,10186184,2444642,14068,77245,9.8000000000000007,10410,0,0.02,1.03,533.21,10876,76.03,491.14,2358.9699999999998,9.06,13187,0.84,9.6999999999999993,26.1]
["ES",2013,"A",1,-1,null,null,null,17707122,8348243,2228639,14054,73957,9.4600000000000009,10396,0,0.02,1.02,491.9,10862,75.069999999999993,489.21,2365.2800000000002,9.6199999999999992,13173,0.83,9.7100000000000009,26.11]
["ES",2013,"A",2,-1,null,null,null,952133,1837941,216003,14,3288,12.05,14,0.24,4.29,13.34,1214.97,14,589.29999999999995,1212.83,2065.77,6.54,14,3.34,5.88,7.61]
["ES",2013,"A","1a",-1,null,null,null,15520178,6029000,1815896,13937,64396,9.8699999999999992,10285,0,0.02,0.97,435.57,10752,69.92,486.9,2373.87,10.01,13056,0.77,9.77,26.26]
["ES",2013,"A","1b",-1,null,null,null,2186944,2319242,412742,117,9561,8.23,111,0.13,1.19,4.4800000000000004,808.52,110,258.58,620.4,1500.59,8.6,117,2.16,4.8099999999999996,10.53]
["ES",2013,"A01",0,-1,null,null,null,16144637,8896017,1955535,12654,66672,9.17,9384,0,0.02,0.97,498.73,9772,79.290000000000006,486.9,2397.65,8.4,11864,0.89,10.050000000000001,27.63]
["ES",2013,"A01",1,-1,null,null,null,15439916,7239243,1812414,12642,63686,8.69,9372,0,0.02,0.97,481.08,9760,78.52,486.03,2401.13,9.3800000000000008,11852,0.88,10.07,27.64]
["ES",2013,"A01",2,-1,null,null,null,704721,1656773,143120,12,2986,13.94,12,0.16,4.29,11.25,785.36,12,559.11,966.45,1497.01,4.12,12,3.04,5.46,6.37]
["ES",2013,"A01","1a",-1,null,null,null,14082956,5218347,1495780,12541,55321,9.32,9275,0,0.02,0.93,428.73,9665,72.510000000000005,484.6,2409.77,10.17,11751,0.82,10.15,27.79]
["ES",2013,"A01","1b",-1,null,null,null,1356959,2020896,316634,101,8365,6.43,97,0.13,0.94,4.01,854.82,95,258.63,625,1373.17,7.34,101,2.16,4.59,10.18]
["ES",2013,"A02",0,-1,null,null,null,1031638,388521,131158,771,4443,19.010000000000002,538,0,0,0.73,338.2,578,20.21,481.18,2015.3,6.68,705,-1.02,5.67,15.64]
["ES",2013,"A02",1,-1,null,null,null,1031638,388521,131158,771,4443,19.010000000000002,538,0,0,0.73,338.2,578,20.21,481.18,2015.3,6.68,705,-1.02,5.67,15.64]
["ES",2013,"A02",2,-1,null,null,null,null,null,null,0,null,null,0,null,null,null,null,0,null,null,null,null,0]
["ES",2013,"A02","1a",-1,null,null,null,633920,310902,106607,766,3858,12.14,534,0,0,0.7,405.4,574,18.03,481.18,2023.3,6.14,700,-1.03,5.73,15.66]
["ES",2013,"A02","1b",-1,null,null,null,null,null,null,5,null,null,4,null,null,null,null,4,null,null,null,null,5]
["ES",2013,"A03",0,-1,null,null,null,1482979,901645,357949,643,6130,11.4,488,0,0.02,2.96,960.31,526,89.02,551.65,2091.39,16.64,618,1.1499999999999999,9.83,17.97]
["ES",2013,"A03",1,-1,null,null,null,1235567,720477,285066,641,5828,12.37,486,0,0.01,2.94,680.22,524,88.16,546.73,2079.23,13.62,616,1.1399999999999999,9.7899999999999991,17.96]
["ES",2013,"A03",2,-1,null,null,null,null,null,null,2,null,null,2,null,null,null,null,2,null,null,null,null,2]
["ES",2013,"A03","1a",-1,null,null,null,803301,499750,213508,630,5217,14.61,476,0,0.01,2.86,534.58000000000004,513,79.28,537.47,2077.15,10.77,605,1.0900000000000001,9.7200000000000006,17.96]
["ES",2013,"A03","1b",-1,null,null,null,432266,220726,71557,11,611,9.64,10,null,null,null,1017.26,11,null,null,null,20.059999999999999,11]
["ES",2013,"B",0,-1,47.07,null,59.02,6972786,2070148,806256,1036,11927,23.31,600,0,0.16,4.16,1206.1500000000001,872,-677.17,179.4,1050.53,18.73,978,-11.74,4.1500000000000004,14.1]
["ES",2013,"B",1,-1,null,null,null,3208699,1234879,370510,1030,8246,35.869999999999997,595,0,0.14000000000000001,3.68,517.41999999999996,867,-680.3,178.45,1022.58,9.9600000000000009,972,-11.76,4.07,14.09]
["ES",2013,"B",2,-1,null,null,null,3764087,835269,435746,6,3681,null,5,null,null,null,null,5,null,null,null,31.69,6,null,16.09]
["ES",2013,"B","1a",-1,null,null,null,2203104,780255,252794,1010,6924,33.159999999999997,577,0,0.13,3.45,307.3,850,-735.72,162,978.05,6.85,952,-11.99,3.93,13.97]
["ES",2013,"B","1b",-1,null,null,null,1005594,454624,117715,20,1322,38,18,null,null,null,1089.52,17,null,null,null,15.32,20]
["ES",2013,"B05",0,-1,29.03,null,60.71,843990,210025,68763,27,2398,-8.7200000000000006,17,0,0.37,3.05,-1087.8699999999999,21,-1738.69,174.36,1710.11,-26.29,24,-9.26,5.81,18.89]
["ES",2013,"B05",1,-1,null,null,null,245269,87276,34320,25,348,34.01,16,null,null,null,1454.73,19,null,null,null,11.67,22]
["ES",2013,"B05",2,-1,null,null,null,null,null,null,2,null,null,1,null,null,null,null,2,null,null,null,null,2]
["ES",2013,"B05","1a",-1,null,null,null,50499,20432,7890,23,165,68.89,14,null,null,null,482.72,18,null,null,null,15.3,20]
["ES",2013,"B05","1b",-1,null,null,null,null,null,null,2,null,null,2,null,null,null,null,1,null,null,null,null,2]
["ES",2013,"B06",0,-1,75,null,39.22,768239,202284,175622,12,140,18.28,8,null,1.96,null,24429.15,9,null,155.55000000000001,null,101.77,8,null,11.18]
["ES",2013,"B06",1,-1,null,null,null,27646,5343,3787,11,91,74.260000000000005,7,null,null,null,170.61,8,null,null,null,12.54,7]
["ES",2013,"B06",2,-1,null,null,null,null,null,null,1,null,null,1,null,null,null,null,1,null,null,null,null,1]
["ES",2013,"B06","1a",-1,null,null,null,27646,5343,3787,11,91,74.260000000000005,7,null,null,null,170.61,8,null,null,null,12.54,7]
["ES",2013,"B06","1b",-1,null,null,null,null,null,null,0,null,null,0,null,null,null,null,0,null,null,null,null,0]
["ES",2013,"B07",0,-1,28.81,null,7.95,79715,41267,6873,17,104,15.04,10,null,0.02,null,433.88,11,null,100,null,6.61,16,-23.99,4.41,19.28]
["ES",2013,"B07",1,-1,null,null,null,79715,41267,6873,17,104,15.04,10,null,null,null,433.88,11,null,null,null,6.61,16]
["ES",2013,"B07",2,-1,null,null,null,null,null,null,0,null,null,0,null,null,null,null,0,null,null,null,null,0]
["ES",2013,"B07","1a",-1,null,null,null,28602,8649,1541,15,36,31.61,8,null,null,null,216.23,9,null,null,null,7.76,14]
["ES",2013,"B07","1b",-1,null,null,null,null,null,null,2,null,null,2,null,null,null,null,2,null,null,null,null,2]
["ES",2013,"B08",0,-1,47.36,null,61.19,3550056,1487420,498516,942,8764,21.22,543,0,0.18,4.16,878.26,807,-691.46,180.11,996.62,14.78,896,-11.99,3.97,13.83]
["ES",2013,"B08",1,-1,null,null,null,2772637,1051693,314211,940,7474,37.799999999999997,541,0,0.18,3.77,488.68,805,-696.34,179.55,978.95,9.99,894,-12.1,3.94,13.81]
["ES",2013,"B08",2,-1,null,null,null,null,null,null,2,null,null,2,null,null,null,null,2,null,null,null,null,2]
["ES",2013,"B08","1a",-1,null,null,null,2062609,716036,231516,925,6403,30.88,528,0,0.16,3.53,304.73,792,-743.33,164.91,962.51,6.67,879,-12.49,3.81,13.8]
["ES",2013,"B08","1b",-1,null,null,null,710027,335656,82694,15,1071,43.56,13,null,null,null,983.52,13,null,null,null,17.059999999999999,15]
["ES",2013,"B09",0,-1,100,null,100,1730784,129151,56480,38,521,6.46,22,0,0,1.64,2567.27,24,-84.65,600.41,2471.02,11.33,34,-7.39,6.48,17.510000000000002]
["ES",2013,"B09",1,-1,null,null,null,83430,49299,11317,37,229,3.06,21,0,0,0.86,791.72,24,-84.65,600.41,2471.02,9.15,33,-8.1,5.83,17.760000000000002]
["ES",2013,"B09",2,-1,null,null,null,null,null,null,1,null,null,1,null,null,null,null,0,null,null,null,null,1]
["ES",2013,"B09","1a",-1,null,null,null,33746,29793,8058,36,229,11.45,20,0,0,1.1200000000000001,339.32,23,-88.29,512.22,3182.11,4.22,32,-8.6199999999999992,5.05,18.03]
["ES",2013,"B09","1b",-1,null,null,null,null,null,null,1,null,null,1,null,null,null,null,1,null,null,null,null,1]
["ES",2013,"C",0,-1,49.21,null,60.91,277808852,290283932,54050344,52796,938197,19.8,36912,0,0.02,1.36,689.93,43985,-83.66,330.31,1415.99,7.01,51588,-1.94,4.01,9.44]
["ES",2013,"C",1,-1,null,null,null,83562436,76612167,22346090,52175,541282,7.76,36338,0,0.02,1.27,553.94000000000005,43393,-95.27,323.43,1388.31,6.97,50968,-2.09,3.96,9.3699999999999992]
["ES",2013,"C",2,-1,null,null,null,194246586,213671765,31704254,621,396915,24.1,574,0.46,2.38,10.35,756.19,592,400.85,1200,4498.59,7.03,620,3.7,7.41,12.78]
["ES",2013,"C","1a",-1,null,null,null,48832642,41435493,13548611,50506,384331,8.17,34812,0,0.01,1.08,410.1,41811,-125.41,308.58,1333.7,5.76,49299,-2.4700000000000002,3.82,9.24]
["ES",2013,"C","1b",-1,null,null,null,34729798,35176673,8797479,1669,156951,7.42,1526,0.24,1.7,5.91,773,1582,320.08999999999997,799.69,3070.98,8.4,1669,3.81,7.29,12.35]
["ES",2013,"C10",0,-1,47.49,null,56,32014219,38571267,6992898,6684,146850,12.04,5155,0,0.01,0.83,600.85,5595,121.18,450,1856.37,7.04,6554,0.63,4.08,8.4499999999999993]
["ES",2013,"C10",1,-1,null,null,null,12675609,14432014,3031635,6553,83736,7.38,5028,0,0.01,0.73,583.38,5468,115.47,441.77,1828.81,6.34,6423,0.57999999999999996,4.03,8.42]
["ES",2013,"C10",2,-1,null,null,null,19338609,24139253,3961262,131,63114,14.45,127,0.48,1.87,6.98,610.42999999999995,127,405.8,847.13,2363.23,7.47,131,3.52,5.69,9.5399999999999991]
["ES",2013,"C10","1a",-1,null,null,null,6406549,6552866,1659201,6189,55648,5.4,4690,0,0,0.53,478.69,5117,94.28,426.96,1796.48,5.69,6059,0.41,3.92,8.32]
["ES",2013,"C10","1b",-1,null,null,null,6269059,7879147,1372434,364,28088,8.76,338,0.15,1.41,5.19,686.84,351,289.85000000000002,627.44000000000005,2523.52,6.87,364,2.68,5.58,9.5299999999999994]
["ES",2013,"C11",0,-1,45.81,null,53.1,13611734,9685696,2386904,1682,23282,7.3,1189,0,0.02,0.83,1250.33,1394,-10.1,348.29,1299.94,12.41,1613,-1.28,8.02,17.25]
["ES",2013,"C11",1,-1,null,null,null,4949105,2395676,581983,1659,10610,10.67,1168,0,0.02,0.8,607.35,1373,-13.61,341.13,1278.77,11.17,1590,-1.65,7.98,17.21]
["ES",2013,"C11",2,-1,null,null,null,8662629,7290020,1804921,23,12672,6.34,21,0.38,1.6,3.26,1794.35,21,1050.25,1346.7,19933.64,12.82,23,5.33,10.76,18.88]
["ES",2013,"C11","1a",-1,null,null,null,3208956,1304258,359406,1602,7752,6.07,1117,0,0.01,0.63,444.83,1318,-39.97,320.45999999999998,1199.6199999999999,10.91,1533,-2.1800000000000002,7.75,17.25]
["ES",2013,"C11","1b",-1,null,null,null,1740148,1091418,222577,57,2858,15.9,51,0.24,1,7.83,1037.04,55,369.84,973.5,3165.26,11.49,57,4.3,9.3000000000000007,15.67]
["ES",2013,"C12",0,-1,100,null,100,5246083,1109850,412678,14,2599,61.99,11,null,2.11,null,334.59,11,null,478.79,null,47.03,13,3.13,4.3,16.87]
["ES",2013,"C12",1,-1,null,null,null,14498,12528,4915,10,149,9.34,7,null,null,null,1212.0999999999999,9,null,null,null,6.4,9]
["ES",2013,"C12",2,-1,null,null,null,null,null,null,4,null,null,4,null,null,null,null,2,null,null,null,null,4]
["ES",2013,"C12","1a",-1,null,null,null,14498,12528,4915,10,149,9.34,7,null,null,null,1212.0999999999999,9,null,null,null,6.4,9]
["ES",2013,"C12","1b",-1,null,null,null,null,null,null,0,null,null,0,null,null,null,null,0,null,null,null,null,0]
["ES",2013,"C13",0,-1,55.65,null,73.59,3030503,3095682,792830,1817,22353,8.5399999999999991,1335,0,0.04,2.25,568.32000000000005,1510,37.29,336.66,1267.72,6.42,1775,0,4.1399999999999997,8.65]
["ES",2013,"C13",1,-1,null,null,null,2676193,2727460,719323,1813,21264,5.42,1331,0,0.03,2.23,491.54,1506,36.9,334.65,1260.19,5.77,1771,-0.03,4.1399999999999997,8.64]
["ES",2013,"C13",2,-1,null,null,null,null,null,null,4,null,null,4,null,null,null,null,4,null,null,null,null,4]
["ES",2013,"C13","1a",-1,null,null,null,1793824,1691638,472238,1765,15064,7.76,1286,0,0.02,1.87,370.79,1461,19.649999999999999,323.70999999999998,1238.46,4.88,1723,-0.16,4.03,8.61]
["ES",2013,"C13","1b",-1,null,null,null,882368,1035822,247085,48,6200,2.87,45,0.21,2.3199999999999998,6.73,767.68,45,321.27999999999997,653.72,3211.24,7.23,48,4.4000000000000004,6.17,10.36]
["ES",2013,"C14",0,-1,37.9,null,58.78,2158456,2636091,632653,1534,19395,6.47,958,0,0,1.68,529.69000000000005,1162,-341.8,197.6,853.77,4.7,1486,-7.44,2.29,7.6]
["ES",2013,"C14",1,-1,null,null,null,1299565,1298732,368420,1520,13394,6.07,951,0,0,1.64,296.29000000000002,1148,-336.52,197.6,836.77,3.98,1472,-7.55,2.31,7.61]
["ES",2013,"C14",2,-1,null,null,null,858891,1337359,264232,14,6001,6.76,7,null,3.13,null,1215.8599999999999,14,-335.47,366.77,2873.7,5.4,14,-1.1299999999999999,0.73,5.21]
["ES",2013,"C14","1a",-1,null,null,null,999780,913194,263358,1502,10870,12.71,934,0,0,1.59,155.12,1130,-363.68,194.63,815.94,2.2999999999999998,1454,-8.1199999999999992,2.27,7.56]
["ES",2013,"C14","1b",-1,null,null,null,299784,385538,105061,18,2524,1.77,17,0.02,1.1000000000000001,2.41,786.93,18,302.97000000000003,495.38,1702.19,7.99,18,2.83,7.24,11.38]
["ES",2013,"C15",0,-1,47.37,null,58.38,1398884,2111619,534571,1542,18591,7.31,1244,0,0.04,1.37,664.35,1245,147.03,356.48,1904.82,5.68,1494,0.95,3.2,6.51]
["ES",2013,"C15",1,-1,null,null,null,1350051,2016216,494944,1541,17661,4.53,1243,0,0.04,1.35,585.82000000000005,1244,146.80000000000001,356.15,1885.87,5.24,1493,0.95,3.2,6.5]
["ES",2013,"C15",2,-1,null,null,null,null,null,null,1,null,null,1,null,null,null,null,1,null,null,null,null,1]
["ES",2013,"C15","1a",-1,null,null,null,1005020,1555798,396524,1519,15764,4.03,1222,0,0.03,1.27,419.28,1223,144.71,353.11,1797.73,4,1471,0.91,3.16,6.42]
["ES",2013,"C15","1b",-1,null,null,null,345031,460418,98419,22,1897,5.31,21,0.56999999999999995,1.72,5.32,1364.01,21,326.45,953.63,3320.21,9.43,22,3.52,5.78,12.57]
["ES",2013,"C16",0,-1,49.42,null,59.4,3597041,2938084,741293,2847,21996,14.03,1755,0,0.01,0.94,291.45,2383,-423.42,209.91,850.57,4.71,2796,-8.9600000000000009,2.5499999999999998,7.63]
["ES",2013,"C16",1,-1,null,null,null,2870234,2227392,597217,2844,19328,10.78,1752,0,0.01,0.93,198.45,2380,-430.06,209.82,850.16,3.52,2793,-8.9700000000000006,2.5499999999999998,7.63]
["ES",2013,"C16",2,-1,null,null,null,null,null,null,3,null,null,3,null,null,null,null,3,null,null,null,null,3]
["ES",2013,"C16","1a",-1,null,null,null,2286490,1876049,525519,2826,17586,9.59,1737,0,0.01,0.82,212.68,2363,-437.16,208.56,849.31,3.62,2775,-9.18,2.5099999999999998,7.63]
["ES",2013,"C16","1b",-1,null,null,null,583743,351342,71698,18,1742,18.61,15,0.8,4.6900000000000004,12.48,139.38999999999999,17,119.89,466.89,985.48,3.03,18,1.3,5.6,6.71]
["ES",2013,"C17",0,-1,49.27,null,56.44,10019229,8068269,1791973,738,24420,18.12,606,0,0.14000000000000001,2.34,723.93,638,165.47,461.9,1923.16,10.86,721,1.8,5.0999999999999996,10.08]
["ES",2013,"C17",1,-1,null,null,null,2191790,2335908,609390,715,12738,5.94,585,0,0.11,2,798.46,616,163.13999999999999,446.05,1846.28,7.38,698,1.76,5,9.81]
["ES",2013,"C17",2,-1,null,null,null,7827438,5732360,1182582,23,11682,21.12,21,0.67,5.03,20.12,707.86,22,467.4,1245.93,2478.41,12.28,23,6.44,9.7899999999999991,14.24]
["ES",2013,"C17","1a",-1,null,null,null,846523,890699,248420,651,6755,11.56,529,0,0.06,1.35,519.37,554,154.58000000000001,422.19,1683.11,6.42,634,1.61,4.9000000000000004,9.66]
["ES",2013,"C17","1b",-1,null,null,null,1345266,1445209,360970,64,5983,3.15,56,0.27,2.15,4.79,1088.69,62,338.63,1530.22,4085.81,7.97,64,3.88,6.56,11.08]
["ES",2013,"C18",0,-1,46.8,null,68.650000000000006,4255958,3512550,1287363,4116,30134,7.81,2785,0,0,0.6,566.54999999999995,3393,-135.97,308.41000000000003,1251.76,8.52,4044,-2.92,4.6500000000000004,10.78]
["ES",2013,"C18",1,-1,null,null,null,3710518,3051277,1119329,4112,27844,7.94,2781,0,0,0.6,469.79,3391,-136.27000000000001,308.41000000000003,1251.51,7.96,4040,-2.93,4.6500000000000004,10.78]
["ES",2013,"C18",2,-1,null,null,null,null,null,null,4,null,null,4,null,null,null,null,2,null,null,null,null,4]
["ES",2013,"C18","1a",-1,null,null,null,2657053,2163373,816495,4060,22338,7.97,2733,0,0,0.53,407.74,3339,-147.1,301.76,1236.08,7.05,3988,-3.03,4.6100000000000003,10.76]
["ES",2013,"C18","1b",-1,null,null,null,1053464,887904,302834,52,5506,7.9,48,0.54,1.4,6.25,632.27,52,331.89,690.87,2095.4299999999998,10.17,52,3.99,8.5500000000000007,13.07]
["ES",2013,"C19",0,-1,94.74,null,88.86,24927614,47401958,806375,18,8212,85.87,13,0,0.05,2.72,528.58000000000004,16,133.63,367.1,2153.83,2.27,18,-0.12,3.59,10.16]
["ES",2013,"C19",1,-1,null,null,null,88583,74942,19481,14,205,2.63,10,null,0.02,null,1183.3699999999999,12,133.63,360.86,2153.83,9.65,14,-0.73,4.2699999999999996,12.12]
["ES",2013,"C19",2,-1,null,null,null,null,null,null,4,null,null,3,null,null,null,null,4,null,null,null,null,4]
["ES",2013,"C19","1a",-1,null,null,null,13068,9865,1608,12,48,15.2,8,null,0.01,null,341.64,10,null,296.87,null,3.65,12,-2.23,3.82,13.3]
["ES",2013,"C19","1b",-1,null,null,null,null,null,null,2,null,null,2,null,null,null,null,2,null,null,null,null,2]
["ES",2013,"C20",0,-1,52.74,null,60.49,23014119,28407651,3932993,1657,48183,22.93,1312,0,0.23,2.67,1105.04,1403,142.26,505.3,2367.4,6.63,1605,1.79,5.48,10.42]
["ES",2013,"C20",1,-1,null,null,null,5167703,5543999,1386893,1593,23958,4.95,1253,0,0.18,2.46,882.58,1343,138.69,480.63,2194.29,8.65,1542,1.61,5.35,10.25]
["ES",2013,"C20",2,-1,null,null,null,17846463,22863651,2546100,64,24225,29.1,59,0.45,1.89,15.39,1209.52,60,790.51,2374.88,9078.61,6.15,63,5.08,7.63,13.45]
["ES",2013,"C20","1a",-1,null,null,null,2010962,1868065,522165,1432,11889,5.6,1103,0,0.09,2.08,533.62,1195,122.73,418.89,1934.67,6.89,1381,1.1599999999999999,4.92,9.77]
["ES",2013,"C20","1b",-1,null,null,null,3156741,3675934,864723,161,12069,4.71,150,0.25,1.45,5.16,1161.53,148,531.69000000000005,1259.8800000000001,6578.9,9.5399999999999991,161,5.19,8.33,13.42]
["ES",2013,"C21",0,-1,57.22,null,72.39,11996682,9287011,3251047,202,27725,8.5,164,0.01,0.77,4.5599999999999996,2330.06,157,256.61,1459.25,5396.66,18.920000000000002,189,4.01,11.66,20.79]
["ES",2013,"C21",1,-1,null,null,null,1481367,1166074,480437,161,6650,6.14,126,0,0.27,3.19,1579.41,117,200.57,979.69,4951.74,15.69,148,3.17,11.01,18.77]
["ES",2013,"C21",2,-1,null,null,null,10515315,8120937,2770609,41,21075,8.7799999999999994,38,1.21,2.1,8.61,2466.3000000000002,40,1415.31,2781.46,6917.28,19.38,41,9.4499999999999993,14.55,21.64]
["ES",2013,"C21","1a",-1,null,null,null,262097,188653,79760,121,1392,5.37,88,0,0.05,1.88,1206.53,83,6.35,514.17999999999995,2818.81,14.61,108,1.08,7.55,18.77]
["ES",2013,"C21","1b",-1,null,null,null,1219269,977420,400677,40,5258,6.28,38,0.26,1.1200000000000001,7.16,1671.05,34,645.20000000000005,1888.52,11667.14,15.89,40,10,15.14,18.809999999999999]
["ES",2013,"C22",0,-1,48.6,null,56.67,8700430,10588897,2948878,1956,47822,7.9,1569,0,7.0000000000000007E-2,1.5,1126.81,1722,150.12,448.53,1567.42,10.9,1918,2.0099999999999998,5.9,11.35]
["ES",2013,"C22",1,-1,null,null,null,4671808,5069932,1389730,1928,29746,5.79,1542,0,0.06,1.46,688.2,1694,146.21,443.76,1504.01,8.14,1890,1.97,5.8,11.26]
["ES",2013,"C22",2,-1,null,null,null,4028621,5518964,1559148,28,18076,9.08,27,0.16,0.77,4.0599999999999996,1746.36,28,768.41,1446.68,4241.47,13.43,28,6.99,9.73,12.07]
["ES",2013,"C22","1a",-1,null,null,null,2410599,2376758,725029,1809,18242,5.15,1429,0,0.04,1.25,515.74,1577,137.61000000000001,430.46,1382.27,7.35,1771,1.79,5.65,11.14]
["ES",2013,"C22","1b",-1,null,null,null,2261209,2693174,664701,119,11504,6.26,113,0.09,0.91,4.43,912.36,117,340.83,783.06,2628.19,8.83,119,3.91,7.55,12.76]
["ES",2013,"C23",0,-1,40.04,null,50.2,19812140,7437383,2173322,2705,41927,51.29,1537,0,0.06,2.2599999999999998,407.79,2350,-893.93,144.68,678.11,13.08,2644,-12.37,2.14,8.56]
["ES",2013,"C23",1,-1,null,null,null,6753265,3736804,1052671,2671,27476,27.76,1505,0,0.05,2.15,276.14,2316,-919.79,138.87,669.19,5.2,2610,-12.57,2.0099999999999998,8.36]
["ES",2013,"C23",2,-1,null,null,null,13058875,3700579,1120650,34,14451,57.17,32,0.83,4.3499999999999996,25.54,462.95,34,232.15,484.09,1159.97,21.02,34,8.73,12.69,20.77]
["ES",2013,"C23","1a",-1,null,null,null,4051847,1947103,575493,2575,19064,59.26,1418,0,0.03,1.93,120.27,2222,-1021.89,123.12,626.96,2.29,2514,-13.16,1.72,8.0299999999999994]
["ES",2013,"C23","1b",-1,null,null,null,2701417,1789700,477177,96,8412,18.420000000000002,87,0.49,1.89,7.23,448.67,94,297.67,569.82000000000005,2103.81,8.3800000000000008,96,4.51,8.49,14]
["ES",2013,"C24",0,-1,97.87,null,71.760000000000005,20231104,19137500,2501993,1101,42116,20.11,818,0,0.11,2.78,258.95,950,18.100000000000001,338,1365.52,3.42,1083,0.17,4.6399999999999997,9.3800000000000008]
["ES",2013,"C24",1,-1,null,null,null,2498326,2502597,652495,1053,14113,9.82,778,0,0.05,2.57,468,904,9.27,331,1330.55,6.03,1035,0.02,4.5999999999999996,9.51]
["ES",2013,"C24",2,-1,null,null,null,17732778,16634902,1849497,48,28003,23.19,40,0.69,2.68,7.43,228.4,46,81.5,525.12,3450.33,3.03,48,0.6,5.25,7.89]
["ES",2013,"C24","1a",-1,null,null,null,1195913,1021705,342266,987,8502,8.77,720,0,0.04,2,430.91,842,-6.46,308.99,1313.31,5.61,969,-0.54,4.5599999999999996,9.41]
["ES",2013,"C24","1b",-1,null,null,null,1302413,1480892,310229,66,5611,10.47,58,0.17,1.63,6.32,494.09,62,194.05,542.27,1342.29,6.31,66,1.25,5.61,9.8000000000000007]
["ES",2013,"C25",0,-1,44.43,null,51.87,13660053,13321296,4219256,9427,93497,8.74,6427,0,0.02,1.18,514.76,8052,-170.82,321.98,1360.36,7.21,9251,-3.25,4.01,9.68]
["ES",2013,"C25",1,-1,null,null,null,10429472,9592595,3408564,9392,81723,6.61,6394,0,0.02,1.1399999999999999,513.08000000000004,8017,-176.99,318.5,1352.88,6.76,9216,-3.3,3.99,9.68]
["ES",2013,"C25",2,-1,null,null,null,3230581,3728701,810691,35,11774,13.24,33,0.95,3.38,8.15,518.79999999999995,35,556.03,1002.22,3009.05,8.3800000000000008,35,5.41,7.39,9.6199999999999992]
["ES",2013,"C25","1a",-1,null,null,null,7463235,6501877,2557365,9231,66919,7.44,6248,0,0.01,1.02,421.76,7861,-194.59,311.52,1329.78,5.87,9055,-3.54,3.9,9.59]
["ES",2013,"C25","1b",-1,null,null,null,2966238,3090717,851199,161,14804,5.43,146,0.28999999999999998,2.08,5.9,744.3,156,319.83999999999997,766.99,2072.62,8.61,161,4.29,7.96,12.27]
["ES",2013,"C26",0,-1,37.869999999999997,null,46.74,2003854,1726582,559494,712,11142,13.45,497,0,7.0000000000000007E-2,2.81,813.19,552,-77.17,369.86,2060.8200000000002,8.09,694,-3.15,4.08,11.17]
["ES",2013,"C26",1,-1,null,null,null,1579251,1166679,430760,704,9241,14.14,490,0,0.06,2.62,576.78,544,-86.96,356.31,1888.41,7.82,686,-3.47,4.05,11.17]
["ES",2013,"C26",2,-1,null,null,null,424602,559902,128734,8,1901,12.83,7,null,7.39,null,3562.92,8,null,5988.41,null,8.74,8,null,7.5]
["ES",2013,"C26","1a",-1,null,null,null,780062,595544,230154,673,5567,16.760000000000002,463,0,0.04,2.09,475.25,516,-126.36,339.45,1823.81,6.25,655,-3.92,3.79,10.91]
["ES",2013,"C26","1b",-1,null,null,null,799189,571134,200605,31,3674,12.36,27,0.35,3.51,10.98,676.53,28,431.24,818.15,2457.75,9.4499999999999993,31,4.21,7.69,14.79]
["ES",2013,"C27",0,-1,48.77,null,65.17,12279331,10303886,2434693,911,37203,8.4499999999999993,639,0,0.15,4.5199999999999996,607.57000000000005,750,-150.66999999999999,319.10000000000002,1361.97,7.14,890,-1.98,3.87,8.94]
["ES",2013,"C27",1,-1,null,null,null,2239428,1858467,561863,880,12609,4.37,610,0,0.13,3.91,409.57,719,-183.59,298.24,1262.1600000000001,5.18,859,-2.5,3.84,8.75]
["ES",2013,"C27",2,-1,null,null,null,10039903,8445418,1872829,31,24594,9.08,29,0.95,4.63,13.69,655.32000000000005,31,322.27,849.49,4563.59,7.57,31,2.4,6.53,12.68]
["ES",2013,"C27","1a",-1,null,null,null,919512,806247,269982,826,7050,13.65,564,0,0.06,3.5,329.94,668,-256.58999999999997,268.8,1160.6600000000001,4.05,805,-3.11,3.68,8.51]
["ES",2013,"C27","1b",-1,null,null,null,1319915,1052219,291881,54,5559,-0.41,46,0.52,3.23,9.16,467.63,51,225.63,738.21,2134.2199999999998,6.04,54,3.1,5.72,10.92]
["ES",2013,"C28",0,-1,64.959999999999994,null,69.73,10901005,10027662,3656083,3240,62349,19.84,2527,0,0.13,2.84,1281.32,2759,148.56,481.94,2243.61,12.74,3164,1.28,5.4,10.67]
["ES",2013,"C28",1,-1,null,null,null,6846378,6042075,2126873,3209,43219,6.91,2498,0,0.12,2.76,668.98,2731,147.30000000000001,478.12,2199.63,8.26,3133,1.26,5.35,10.62]
["ES",2013,"C28",2,-1,null,null,null,4054627,3985587,1529209,31,19130,28.12,29,0.74,2.52,12.15,3101.48,28,523.07000000000005,1628.64,17448.72,19.54,31,5.51,8.35,13.32]
["ES",2013,"C28","1a",-1,null,null,null,4076338,3559404,1337219,3090,30291,6.59,2386,0,0.09,2.37,541.72,2622,134.32,465.93,2155.5100000000002,7.26,3014,1.1299999999999999,5.25,10.34]
["ES",2013,"C28","1b",-1,null,null,null,2770039,2482670,789654,119,12928,7.26,112,0.79,3.19,8.56,894.4,109,396.72,896.4,3785.57,9.6999999999999993,119,5.14,8.83,14.1]
["ES",2013,"C29",0,-1,51.51,null,78.67,25388931,45110875,6773326,800,106938,8.86,597,0,0.22,2.98,1217.77,676,47.1,388.71,1846.93,5.29,778,0.34,4.6399999999999997,9.83]
["ES",2013,"C29",1,-1,null,null,null,2374313,2509242,792821,737,17567,9.9600000000000009,537,0,0.14000000000000001,2.44,781.33,618,12.67,341.68,1555.04,7.82,715,-0.06,4.5,9.7899999999999991]
["ES",2013,"C29",2,-1,null,null,null,23014617,42601633,5980505,63,89371,8.7799999999999994,60,0.11,1.17,8.18,1282.03,58,467.68,1742.22,7578.52,5.15,63,3.53,5.94,11.47]
["ES",2013,"C29","1a",-1,null,null,null,874182,762722,289643,657,7516,9.89,470,0,7.0000000000000007E-2,1.71,591.82000000000005,543,-19.149999999999999,305.67,1233.45,7.77,635,-0.42,4.08,9.4]
["ES",2013,"C29","1b",-1,null,null,null,1500131,1746519,503177,80,10051,9.99,67,0.2,1.99,8.86,906.86,75,273.51,1445.74,3855.28,7.85,80,4.1100000000000003,6.29,13.65]
["ES",2013,"C30",0,-1,47.41,null,76.400000000000006,20723062,8815269,2703918,293,34793,30.27,198,0,0.1,2.44,424.46,233,-159.51,341.35,1541.06,9.43,284,-3.29,4.01,11.45]
["ES",2013,"C30",1,-1,null,null,null,1060997,862901,321938,276,6613,5.68,182,0,0.06,1.54,572.29999999999995,216,-193.49,310.73,1389.33,8.02,267,-4.1100000000000003,3.37,10.58]
["ES",2013,"C30",2,-1,null,null,null,19662065,7952368,2381980,17,28180,32.51,16,1.02,3.82,15.46,414.74,17,456.04,780.86,4663.8900000000003,9.58,17,9,10.79,17.600000000000001]
["ES",2013,"C30","1a",-1,null,null,null,357303,229662,105669,248,2743,16.100000000000001,155,0,0.01,0.88,467.15,190,-366.16,263.39999999999998,1329.54,7.16,239,-7.12,3.05,10.42]
["ES",2013,"C30","1b",-1,null,null,null,703693,633238,216268,28,3870,2.4300000000000002,27,0.16,1.6,5.86,615.51,26,344.92,653.65,2332.7199999999998,8.33,28,3.56,8.0299999999999994,10.77]
["ES",2013,"C31",0,-1,43.69,null,49.57,2661437,1914244,596498,2896,21498,77.510000000000005,1524,0,0,1.02,95.05,2430,-1163.6400000000001,87.57,478.29,1.72,2835,-16.11,0.93,6.12]
["ES",2013,"C31",1,-1,null,null,null,2254019,1772215,553881,2894,20326,26.86,1523,0,0,1.01,104.19,2428,-1165.1300000000001,87.57,479.15,1.72,2833,-16.12,0.93,6.12]
["ES",2013,"C31",2,-1,null,null,null,null,null,null,2,null,null,1,null,null,null,null,2,null,null,null,null,2]
["ES",2013,"C31","1a",-1,null,null,null,1825267,1381243,442621,2873,17607,128.80000000000001,1505,0,0,0.98,21.94,2408,-1211,83.35,470.33,0.37,2812,-16.260000000000002,0.88,6.08]
["ES",2013,"C31","1b",-1,null,null,null,428751,390971,111259,21,2719,6.29,18,0.26,1.44,11.13,442.28,20,243.41,535.49,1573.57,6.5,21,2.68,7.32,10.37]
["ES",2013,"C32",0,-1,51.95,null,62.12,2272756,2099329,686439,1852,16353,4.9400000000000004,1243,0,0.01,0.87,739.62,1425,-98.71,365.25,1527.18,8.35,1787,-3.26,4.33,10.51]
["ES",2013,"C32",1,-1,null,null,null,1803184,1673328,570516,1849,14891,5.03,1240,0,0.01,0.87,581.17999999999995,1423,-106,365.25,1533.59,7.15,1784,-3.27,4.33,10.5]
["ES",2013,"C32",2,-1,null,null,null,null,null,null,3,null,null,3,null,null,null,null,2,null,null,null,null,3]
["ES",2013,"C32","1a",-1,null,null,null,1347318,1149466,424277,1826,12226,6.04,1218,0,0,0.79,492.49,1402,-141.26,345.74,1494.95,6.6,1761,-3.48,4.2300000000000004,10.41]
["ES",2013,"C32","1b",-1,null,null,null,455865,523861,146239,23,2665,3.31,22,0.37,1.4,4.7,844.56,21,492.13,988.54,2072.5500000000002,8.3699999999999992,23,5.14,8.5299999999999994,13.38]
["ES",2013,"C33",0,-1,78.760000000000005,null,50.77,3904650,2975270,1232826,4052,28819,5.27,2809,0,0,0.7,728.35,3179,-120.59,393,2248.12,7.2,3952,-1.88,3.48,8.84]
["ES",2013,"C33",1,-1,null,null,null,2577082,2543104,1069969,4047,26221,3.69,2804,0,0,0.68,657.05,3176,-121.66,392.69,2249.3000000000002,6.91,3947,-1.88,3.47,8.84]
["ES",2013,"C33",2,-1,null,null,null,null,null,null,5,null,null,5,null,null,null,null,3,null,null,null,null,5]
["ES",2013,"C33","1a",-1,null,null,null,2026463,2076764,899243,4022,23349,4.1900000000000004,2782,0,0,0.65,583.98,3158,-132.88999999999999,390.81,2245.58,6.2,3922,-1.97,3.44,8.7899999999999991]
["ES",2013,"C33","1b",-1,null,null,null,550618,466339,170725,25,2872,2.33,22,null,null,null,1000.41,18,null,null,null,10.06,25]
["ES",2013,"D",0,-1,88.73,null,88.85,202346724,97605089,15032362,12002,32424,33.46,10265,0,0,0.44,649.64,9186,177.96,367.96,856.08,19.079999999999998,11887,7.57,70.25,80.319999999999993]
["ES",2013,"D",1,-1,null,null,null,11928847,2410802,1197033,11946,4064,2.76,10212,0,0,0.44,304.57,9131,177.74,366.02,851.77,44.79,11831,7.7,70.290000000000006,80.34]
["ES",2013,"D",2,-1,null,null,null,190417877,95194287,13835329,56,28360,35.35,53,0.05,1.48,20.92,698.33,55,318.24,870.63,2043.19,18.43,56,5.29,23.57,69.099999999999994]
["ES",2013,"D","1a",-1,null,null,null,7670895,1554348,776538,11904,3139,4.45,10171,0,0,0.44,368.7,9093,177.85,365.65,850.26,45.52,11789,7.64,70.290000000000006,80.34]
["ES",2013,"D","1b",-1,null,null,null,4257952,856453,420495,42,925,-0.46,41,0,0.18,1,228.88,38,166.89,403.46,3317.51,43.46,42,10.83,61.76,70.650000000000006]
["ES",2013,"D35",0,-1,88.73,null,88.85,202346724,97605089,15032362,12002,32424,33.46,10265,0,0,0.44,649.64,9186,177.96,367.96,856.08,19.079999999999998,11887,7.57,70.25,80.319999999999993]
["ES",2013,"D35",1,-1,null,null,null,11928847,2410802,1197033,11946,4064,2.76,10212,0,0,0.44,304.57,9131,177.74,366.02,851.77,44.79,11831,7.7,70.290000000000006,80.34]
["ES",2013,"D35",2,-1,null,null,null,190417877,95194287,13835329,56,28360,35.35,53,0.05,1.48,20.92,698.33,55,318.24,870.63,2043.19,18.43,56,5.29,23.57,69.099999999999994]
["ES",2013,"D35","1a",-1,null,null,null,7670895,1554348,776538,11904,3139,4.45,10171,0,0,0.44,368.7,9093,177.85,365.65,850.26,45.52,11789,7.64,70.290000000000006,80.34]
["ES",2013,"D35","1b",-1,null,null,null,4257952,856453,420495,42,925,-0.46,41,0,0.18,1,228.88,38,166.89,403.46,3317.51,43.46,42,10.83,61.76,70.650000000000006]
["ES",2013,"E",0,-1,46.22,null,80.87,37342543,10426500,5468510,1506,93114,35.03,1180,0,0.12,2.66,581.66,1213,148.44999999999999,673.73,3193.68,31.71,1457,1.83,8.67,19.059999999999999]
["ES",2013,"E",1,-1,null,null,null,6257351,3305665,1417268,1468,29192,11.42,1142,0,0.1,2.42,627.73,1178,139.41999999999999,668.6,3231.85,15.61,1419,1.77,8.33,18.47]
["ES",2013,"E",2,-1,null,null,null,null,null,null,38,null,null,38,null,null,null,null,35,null,null,null,null,38]
["ES",2013,"E","1a",-1,null,null,null,2198628,1339427,511105,1380,12590,5.8,1058,0,0.08,1.99,652.57000000000005,1097,129.53,665.58,3184.18,11.08,1331,1.59,7.97,17.87]
["ES",2013,"E","1b",-1,null,null,null,4058722,1966238,906163,88,16602,13.69,84,7.0000000000000007E-2,1.79,9.23,618.23,81,337.92,809.71,4475.32,18.690000000000001,88,7.37,15.9,25.77]
["ES",2013,"E36",0,-1,48.89,null,87.01,20737396,4494571,2237903,419,26033,16.920000000000002,332,0,0.56999999999999995,6.56,830.13,314,183.2,753.39,3493.59,29.84,407,2.46,12.3,23.34]
["ES",2013,"E36",1,-1,null,null,null,2953649,1125015,505266,393,7480,13.4,306,0,0.4,5.53,505.1,290,160.61000000000001,721.87,3577.61,20.239999999999998,381,2.04,10.78,23.09]
["ES",2013,"E36",2,-1,null,null,null,17783747,3369556,1732637,26,18553,17.66,26,1.37,12.5,29.08,956.18,24,680.21,1151.1500000000001,1851.76,33.049999999999997,26,18.55,21.16,26.48]
["ES",2013,"E36","1a",-1,null,null,null,857313,319140,137213,356,2695,4.37,271,0,0.37,4.37,645.6,256,153.63999999999999,721.87,3772.45,15.34,344,1.65,10.14,21.89]
["ES",2013,"E36","1b",-1,null,null,null,2096336,805874,368052,37,4785,15.87,35,7.0000000000000007E-2,1.27,10.52,476.7,34,317.51,736.01,2397.63,22.18,37,10.32,19.97,27.69]
["ES",2013,"E37",0,-1,38.700000000000003,null,45.76,637625,207353,92613,101,1321,19.66,84,0,0.18,2.3199999999999998,1302.28,94,138.88999999999999,779.11,1636.73,24.09,100,3.35,9.9499999999999993,17.07]
["ES",2013,"E37",1,-1,null,null,null,637625,207353,92613,101,1321,19.66,84,0,0.18,2.3199999999999998,1302.28,94,138.88999999999999,779.11,1636.73,24.09,100,3.35,9.9499999999999993,17.07]
["ES",2013,"E37",2,-1,null,null,null,null,null,null,0,null,null,0,null,null,null,null,0,null,null,null,null,0]
["ES",2013,"E37","1a",-1,null,null,null,128284,68173,33420,95,784,6.36,78,0,0.15,1.85,487.39,89,124.97,723.24,1546.34,13.66,94,2.92,9.5,16.13]
["ES",2013,"E37","1b",-1,null,null,null,509341,139180,59192,6,537,22.71,6,null,null,null,null,5,null,null,null,29.2,6]
["ES",2013,"E38",0,-1,41.13,null,79.33,15658392,5506121,3075330,816,64349,48.51,644,0,0.06,1.84,474.66,667,177.82,648.49,3201.25,34.450000000000003,785,2.0299999999999998,7.85,17.690000000000001]
["ES",2013,"E38",1,-1,null,null,null,2356947,1754842,756725,804,18980,7.96,632,0,0.05,1.71,735.87,656,167.56,646.21,3197.46,12.58,773,2,7.83,17.32]
["ES",2013,"E38",2,-1,null,null,null,null,null,null,12,null,null,12,null,null,null,null,11,null,null,null,null,12]
["ES",2013,"E38","1a",-1,null,null,null,1069989,832612,296288,764,8002,6.29,594,0,0.03,1.47,680.2,618,153.56,655.16,3158.62,9.5500000000000007,733,1.83,7.57,17.12]
["ES",2013,"E38","1b",-1,null,null,null,1286957,922230,460436,40,10978,8.9,38,null,null,null,771.42,38,null,null,null,15.32,40]
["ES",2013,"E39",0,-1,100,null,100,309128,218453,62663,170,1411,6.34,120,0,0.03,0.94,538.25,138,-48.4,554.91,3508.13,8.08,165,-0.44,6.03,15.46]
["ES",2013,"E39",1,-1,null,null,null,309128,218453,62663,170,1411,6.34,120,0,0.03,0.94,538.25,138,-48.4,554.91,3508.13,8.08,165,-0.44,6.03,15.46]
["ES",2013,"E39",2,-1,null,null,null,null,null,null,0,null,null,0,null,null,null,null,0,null,null,null,null,0]
["ES",2013,"E39","1a",-1,null,null,null,143041,119500,44183,165,1109,8.3000000000000007,115,0,0.01,0.76,681.78,134,-75.95,544.20000000000005,2840.47,8.94,160,-0.57999999999999996,6.14,15.49]
["ES",2013,"E39","1b",-1,null,null,null,null,null,null,5,null,null,5,null,null,null,null,4,null,null,null,null,5]
["ES",2013,"F",0,-1,27.5,null,50.65,111914451,42194492,13352410,60964,329166,40.229999999999997,35335,0,0,0.75,193.45,45735,-605.34,171.32,1044.6300000000001,7.21,55010,-10.39,2.54,9.83]
["ES",2013,"F",1,-1,null,null,null,61423438,22751727,8267923,60879,253229,35.28,35264,0,0,0.74,138.43,45650,-610.57000000000005,170.92,1043.54,3.96,54925,-10.42,2.5299999999999998,9.81]
["ES",2013,"F",2,-1,null,null,null,50491012,19442764,5084486,85,75937,42.3,71,7.28,23.12,43.31,232.23,85,128.55000000000001,484.43,1420.22,11.02,85,3.1,8.4499999999999993,18.73]
["ES",2013,"F","1a",-1,null,null,null,51179067,18983031,7017286,60626,227478,35.909999999999997,35061,0,0,0.71,139.44,45404,-620.19000000000005,170.04,1037.8,3.25,54678,-10.5,2.5099999999999998,9.8000000000000007]
["ES",2013,"F","1b",-1,null,null,null,10244370,3768696,1250636,253,25751,33.92,203,1.0900000000000001,4.97,18.03,136.34,246,103.85,384.34,1410.81,7.52,247,1.73,5.41,11.81]
["ES",2013,"F41",0,-1,18.079999999999998,null,31.72,60086398,11216748,2213034,27559,83427,-163.03,15258,0,0,1.58,-23.94,20287,-577.94000000000005,115.34,856.71,-1.66,22686,-14.9,2.81,16.739999999999998]
["ES",2013,"F41",1,-1,null,null,null,41318597,7196279,2228264,27539,75195,68.849999999999994,15245,0,0,1.57,61.03,20267,-580.14,115.33,857.51,3.54,22666,-14.9,2.81,16.75]
["ES",2013,"F41",2,-1,null,null,null,18767801,4020469,-15229,20,8232,-29.15,13,3.63,20.89,50.31,-122.05,20,-88.36,146.6,476.3,-10.99,20,-26.78,4.17,7.77]
["ES",2013,"F41","1a",-1,null,null,null,35370452,6285037,2089587,27449,71545,57.46,15183,0,0,1.49,91.57,20180,-588.30999999999995,115.12,857.16,3.91,22582,-14.92,2.79,16.79]
["ES",2013,"F41","1b",-1,null,null,null,null,null,null,90,null,null,62,null,null,null,null,87,null,null,null,null,84]
["ES",2013,"F42",0,-1,83.63,null,91.82,28119891,13647214,4402504,1727,61331,24.41,1131,0,0.04,3.3,424.09,1398,-238.96,308.36,1462.69,14.69,1640,-3.93,4.12,11.61]
["ES",2013,"F42",1,-1,null,null,null,4475670,2465939,883013,1687,20456,25.89,1093,0,0.02,2.73,433.66,1358,-288.29000000000002,304.43,1441.64,9.5399999999999991,1600,-4.8099999999999996,3.84,11.31]
["ES",2013,"F42",2,-1,null,null,null,23644220,11181275,3519491,40,40875,24.21,38,7.28,22.09,36.93,422.84,40,228,715.74,2125.65,15.83,40,6.73,12.43,22.31]
["ES",2013,"F42","1a",-1,null,null,null,2214618,1330839,466291,1630,12690,19.850000000000001,1040,0,0.02,1.88,260.25,1303,-333.48,293.13,1378.36,4.79,1543,-5.34,3.67,11.17]
["ES",2013,"F42","1b",-1,null,null,null,2261052,1135100,416721,57,7766,28.14,53,1.97,7.29,22.83,576.41,55,228.58,607.09,1906.63,15.11,57,4.2300000000000004,9.3000000000000007,13.87]
["ES",2013,"F43",0,-1,47.13,null,57.6,23708224,17330528,6736859,31678,184408,35.14,18946,0,0,0.43,382.9,24050,-663.23,214.97,1190.99,7.06,30684,-8.5399999999999991,2.33,7.66]
["ES",2013,"F43",1,-1,null,null,null,15629233,13089508,5156634,31653,157578,19.8,18926,0,0,0.42,230.41,24025,-666.33,214.82,1190.99,3.13,30659,-8.56,2.33,7.66]
["ES",2013,"F43",2,-1,null,null,null,8078991,4241020,1580225,25,26830,42.86,20,11.71,30.52,50.83,574.23,25,96.64,492.41,1114.5999999999999,19.190000000000001,25,1.98,7.85,16.059999999999999]
["ES",2013,"F43","1a",-1,null,null,null,13594060,11367154,4461396,31547,143243,22.07,18838,0,0,0.41,205.58,23921,-673.29,213.81,1188.1500000000001,2.71,30553,-8.6,2.3199999999999998,7.65]
["ES",2013,"F43","1b",-1,null,null,null,2035173,1722353,695238,106,14335,12.98,88,0.45,2.86,9.4499999999999993,362.09,104,166.96,522.04,1420.76,5.93,106,1.28,4.22,9.06]
["ES",2013,"G",0,-1,39.68,null,64.569999999999993,218808978,322823172,46282301,117094,1165366,22.06,76515,0,0.02,1.49,665.45,88195,-219.62,277.77,1333.43,4.79,112785,-2.95,2.04,5.96]
["ES",2013,"G",1,-1,null,null,null,95737256,129679132,21445604,116630,621574,9.81,76092,0,0.01,1.45,434.71,87767,-223.81,276.12,1321.53,3.34,112323,-2.99,2.0299999999999998,5.95]
["ES",2013,"G",2,-1,null,null,null,123071762,193144039,24836607,464,543792,26.86,423,0.41,3.23,12.27,838.94,428,319.48,1029.9000000000001,4621.17,5.76,462,1.73,3.73,7.04]
["ES",2013,"G","1a",-1,null,null,null,70730498,86481332,15607172,114357,494588,9.99,74017,0,0.01,1.27,349.41,85678,-249.54,267.85000000000002,1290.04,2.96,110051,-3.23,2,5.97]
["ES",2013,"G","1b",-1,null,null,null,25006941,43197799,5838431,2273,126986,9.56,2075,0.31,2.2999999999999998,8.1300000000000008,673.02,2089,261.45,661.29,2701.09,4.09,2272,1.31,2.86,5.54]
["ES",2013,"G45",0,-1,46.37,null,61.77,16297448,25584776,3822669,16334,106814,7.63,9527,0,0.01,1.24,341.48,12647,-615.77,182.1,821.73,2.06,15935,-6.08,1.28,4.7]
["ES",2013,"G45",1,-1,null,null,null,12099678,16810711,3151669,16293,94375,10.84,9498,0,0.01,1.22,285.61,12609,-616.65,181.8,820.67,2.25,15894,-6.12,1.28,4.7]
["ES",2013,"G45",2,-1,null,null,null,4197769,8774065,670999,41,12439,-0.44,29,0.11,1.61,9.9,671.82,38,-112.48,380.09,918.38,1.71,41,-0.08,2.09,3.42]
["ES",2013,"G45","1a",-1,null,null,null,8270108,9786475,2206101,15906,72774,13.68,9173,0,0.01,1.03,198.17,12239,-667.41,174.79,818.73,1.8,15508,-6.45,1.24,4.7699999999999996]
["ES",2013,"G45","1b",-1,null,null,null,3829583,7024235,945567,387,21601,8.3699999999999992,325,0.28999999999999998,2.2400000000000002,8.94,464.52,370,139.05000000000001,380.9,852.96,2.87,386,0.82,1.93,3.68]
["ES",2013,"G46",0,-1,38.18,null,55.13,119746136,179550021,21243909,54681,424298,26.79,39223,0,0.05,2.29,695.31,41457,42.79,370.72,1837.83,4.88,52254,-0.18,2.74,7.12]
["ES",2013,"G46",1,-1,null,null,null,59966891,80993601,12490331,54389,309876,9.31,38947,0,0.05,2.23,509.67,41187,39.130000000000003,367.62,1824.96,3.93,51963,-0.2,2.73,7.12]
["ES",2013,"G46",2,-1,null,null,null,59779270,98556420,8753488,292,114422,36.78,276,0.42,3.65,13.4,877.85,270,339.71,1136.78,3945.19,5.67,291,1.85,3.96,7.51]
["ES",2013,"G46","1a",-1,null,null,null,42584424,51695336,8702975,52860,238301,9.08,37515,0,0.04,2.0099999999999998,427.02,39777,20.260000000000002,355.3,1779.85,3.65,50434,-0.39,2.7,7.17]
["ES",2013,"G46","1b",-1,null,null,null,17382678,29298265,3787355,1529,71575,9.65,1432,0.28999999999999998,2.0699999999999998,7.97,709.6,1410,299.05,764.39,3180.6,4.42,1529,1.48,3.16,5.92]
["ES",2013,"G47",0,-1,39.51,null,73.55,82765634,117688374,21215700,46079,634254,16.649999999999999,27765,0,0,0.7,679.69,34091,-481.55,218.77,1037.19,5.24,44596,-5.34,1.44,5.18]
["ES",2013,"G47",1,-1,null,null,null,23670911,31874819,5803581,45948,217323,11.58,27647,0,0,0.68,322.3,33971,-486.36,217.45,1027.5,2.42,44466,-5.4,1.44,5.17]
["ES",2013,"G47",2,-1,null,null,null,59094722,85813554,15412119,131,416931,17.37,118,0.45,2.16,9.9499999999999993,807.73,120,442.77,1583.95,10908.1,6.29,130,1.93,3.96,7.14]
["ES",2013,"G47","1a",-1,null,null,null,19876136,24999520,4698095,45591,183513,12.39,27329,0,0,0.62,247.52,33662,-498.6,214.65,1009.26,2.0099999999999998,44109,-5.54,1.42,5.16]
["ES",2013,"G47","1b",-1,null,null,null,3794775,6875298,1105485,357,33810,10.11,318,0.52,3.2,8.07,738.92,309,274.72000000000003,920.58,4989.95,3.92,357,1.19,3.02,5.65]
["ES",2013,"H",0,-1,37.19,null,72.59,170878491,51581992,21675789,18031,351739,9.1199999999999992,12903,0,0.01,0.78,434.47,14355,6.77,487.73,1861.74,16.52,17428,-0.5,4.93,12.96]
["ES",2013,"H",1,-1,null,null,null,25857429,21248117,7065022,17897,159519,7.57,12779,0,0.01,0.71,547.23,14231,2.39,486.85,1859.49,9.2200000000000006,17295,-0.56999999999999995,4.91,12.9]
["ES",2013,"H",2,-1,null,null,null,145021062,30333874,14610766,134,192220,9.59,124,0.35,3.97,11.55,409.3,124,233.97,537.01,2218.0500000000002,21.64,133,2.4900000000000002,7.17,46.13]
["ES",2013,"H","1a",-1,null,null,null,13370248,13700319,4450448,17492,116294,6.11,12406,0,0,0.62,618.85,13865,-13.91,478.5,1819.23,7.15,16894,-0.74,4.8600000000000003,12.83]
["ES",2013,"H","1b",-1,null,null,null,12487180,7547798,2614574,405,43225,9.0399999999999991,373,0.08,1.66,7.01,490.49,366,345.81,924.74,4065.06,12.98,401,2.88,6.48,14.99]
["ES",2013,"H49",0,-1,41.46,null,72.03,44920190,23407017,9185737,12832,172922,10.14,9183,0,0,0.41,434.61,10401,13.12,487.47,1704.52,12.61,12405,-0.49,5.46,12.98]
["ES",2013,"H49",1,-1,null,null,null,11955357,12972959,4449485,12781,109341,4.43,9136,0,0,0.39,603.41999999999996,10353,10.74,486.37,1703.76,7.64,12354,-0.5,5.46,12.99]
["ES",2013,"H49",2,-1,null,null,null,32964832,10434057,4736251,51,63581,13.03,47,0.93,3.81,8.27,380.73,48,262.52999999999997,661.21,1692.65,18.78,51,2.82,5.09,8.3800000000000008]
["ES",2013,"H49","1a",-1,null,null,null,8073806,9011934,3076467,12569,82260,4.16,8943,0,0,0.34,606.58000000000004,10161,2.78,481.21,1694.44,7.17,12143,-0.63,5.45,13]
["ES",2013,"H49","1b",-1,null,null,null,3881551,3961024,1373017,212,27081,4.9400000000000004,193,0.05,1.6,5.97,597.59,192,338.87,813.95,2539.3200000000002,8.7200000000000006,211,2.77,6.08,12.37]
["ES",2013,"H50",0,-1,100,null,100,1617379,1184310,284439,455,4690,9.75,297,0,0.01,1.8,707.9,348,-299.55,385.75,2310.73,9.68,439,-5.37,3.4,12.38]
["ES",2013,"H50",1,-1,null,null,null,645867,633691,153226,453,3130,8.27,295,0,0.01,1.71,732.55,347,-301.33,386.11,2318.84,7.46,437,-5.41,3.37,12.34]
["ES",2013,"H50",2,-1,null,null,null,null,null,null,2,null,null,2,null,null,null,null,1,null,null,null,null,2]
["ES",2013,"H50","1a",-1,null,null,null,433494,357928,110241,442,2527,7.51,286,0,0.01,1.63,783.18,336,-337.16,379.51,2172.21,9.0399999999999991,426,-5.44,3.38,12.4]
["ES",2013,"H50","1b",-1,null,null,null,212373,275763,42985,11,603,10.15,9,null,null,null,643.95000000000005,11,null,null,null,5.42,11]
["ES",2013,"H51",0,-1,66.06,null,88.61,7237436,7596277,1873828,144,25402,-59.39,101,0,0.01,1.79,336.41,99,132.1,580.28,4414.42,0.87,135,-0.64,3.76,10.67]
["ES",2013,"H51",1,-1,null,null,null,291037,235666,64472,137,1087,15.14,96,0,0.01,2.06,443.25,93,140.44,575.38,3770.1,8.35,128,-0.65,3.73,10.76]
["ES",2013,"H51",2,-1,null,null,null,6946399,7360610,1809356,7,24315,null,5,null,null,null,305.70999999999998,6,null,8864.5,null,0.63,7,null,6.29]
["ES",2013,"H51","1a",-1,null,null,null,111059,99554,22754,130,570,11.21,89,0,0,1.68,497.34,88,118.9,577.83000000000004,3818.48,6.09,121,-1.23,3.57,11.18]
["ES",2013,"H51","1b",-1,null,null,null,179977,136112,41717,7,517,16.899999999999999,7,null,null,null,null,5,null,null,null,10,7]
["ES",2013,"H52",0,-1,29.65,null,56.6,114369796,17009592,8886794,4158,87007,9.06,3054,0,7.0000000000000007E-2,3.03,444.4,3164,44.59,522.79,2680.72,32.450000000000003,4018,0.05,3.97,13.91]
["ES",2013,"H52",1,-1,null,null,null,12773117,7132644,2309857,4089,42267,10.9,2986,0,0.06,2.89,494.42,3100,25.48,521.69000000000005,2693.12,12.52,3950,-7.0000000000000007E-2,3.91,13.52]
["ES",2013,"H52",2,-1,null,null,null,101596679,9876948,6576936,69,44740,8.7100000000000009,68,0.31,4.6900000000000004,12.8,435.9,64,243.84,565.86,2329.59,46.85,68,3.5,26.68,66.69]
["ES",2013,"H52","1a",-1,null,null,null,4582330,3998257,1160861,3917,27418,10.199999999999999,2825,0,0.04,2.5499999999999998,651.79999999999995,2945,-10.5,502.7,2611.1799999999998,7.25,3781,-0.31,3.74,13.13]
["ES",2013,"H52","1b",-1,null,null,null,8190787,3134386,1148996,172,14849,11.23,161,0.11,2.0299999999999998,8.89,443.06,155,383.91,1057.3900000000001,5714.16,19.260000000000002,169,3.04,8.39,24.83]
["ES",2013,"H53",0,-1,100,null,100,2733691,2384793,1444989,442,61718,-9.6300000000000008,268,0,0,0.68,-2782.6,343,-313.64,269.83,1088.45,-5.2,431,-3.83,1.99,6.57]
["ES",2013,"H53",1,-1,null,null,null,192053,273155,87980,437,3694,11.86,266,0,0,0.67,388.26,338,-289.42,270.22000000000003,1101.7,3.1,426,-3.8,2.09,6.58]
["ES",2013,"H53",2,-1,null,null,null,null,null,null,5,null,null,2,null,null,null,null,5,null,null,null,null,5]
["ES",2013,"H53","1a",-1,null,null,null,169562,232643,80123,434,3519,10.38,263,0,0,0.62,275.5,335,-299.85000000000002,268.76,1055.98,2.29,423,-3.83,1.99,6.57]
["ES",2013,"H53","1b",-1,null,null,null,null,null,null,3,null,null,3,null,null,null,null,3,null,null,null,null,3]
["ES",2013,"I",0,-1,36.36,null,53.13,34931836,19922160,8956758,29334,314127,17.559999999999999,17276,0,0,0.25,299.43,21600,-515.33000000000004,237.6,1186.46,8.94,28114,-6.03,2,8.07]
["ES",2013,"I",1,-1,null,null,null,24055216,15256436,6646488,29294,237150,9.02,17241,0,0,0.24,372.6,21561,-517.89,237.16,1183.25,7.86,28074,-6.03,2,8.0500000000000007]
["ES",2013,"I",2,-1,null,null,null,10876619,4665723,2310270,40,76977,35.28,35,0.52,3.19,15.12,213.63,39,141.9,585.33000000000004,3104.94,12.49,40,3.11,9.14,13.91]
["ES",2013,"I","1a",-1,null,null,null,18022872,12802803,5379773,29163,202136,8.39,17116,0,0,0.22,358.45,21434,-527.70000000000005,235.21,1177.1400000000001,6.19,27943,-6.08,1.97,7.98]
["ES",2013,"I","1b",-1,null,null,null,6032344,2453632,1266714,131,35014,10.28,125,0.47,2.4500000000000002,10.06,403.85,127,221.95,746.92,1919.67,16.53,131,6.87,14.12,24.28]
["ES",2013,"I55",0,-1,49.5,null,55.06,24983624,7888464,3985794,6481,104029,19.77,4429,0,0.01,1.06,299.08999999999997,5173,-42.96,303.60000000000002,1333.29,16.350000000000001,6186,-2.68,7.95,20.67]
["ES",2013,"I55",1,-1,null,null,null,16630215,5910251,2971669,6464,78402,8.9600000000000009,4415,0,0.01,1.04,405.39,5157,-43.11,303.51,1333.29,15.69,6169,-2.71,7.94,20.64]
["ES",2013,"I55",2,-1,null,null,null,null,null,null,17,null,null,14,null,null,null,null,16,null,null,null,null,17]
["ES",2013,"I55","1a",-1,null,null,null,11051083,4244057,2087084,6372,59551,7.55,4327,0,0.01,0.93,429,5066,-53.11,301.60000000000002,1325.71,13.59,6077,-2.89,7.67,20.29]
["ES",2013,"I55","1b",-1,null,null,null,5579131,1666193,884584,92,18851,11.29,88,0.46,3.33,10.87,371.77,91,187.79,616.4,1713.75,21.03,92,12.15,20.45,27.82]
["ES",2013,"I56",0,-1,33.82,null,52.23,9948221,12033695,4970964,22853,210098,11.73,12847,0,0,0.12,300.35000000000002,16427,-799.29,213.07,1134.3499999999999,4.08,21928,-6.58,1.35,5.98]
["ES",2013,"I56",1,-1,null,null,null,7425011,9346185,3674818,22830,158748,9.24,12826,0,0,0.12,291.97000000000003,16404,-801.32,212.62,1130.69,2.9,21905,-6.59,1.34,5.97]
["ES",2013,"I56",2,-1,null,null,null,2523210,2687510,1296146,23,51350,14.83,21,-0.37,1.63,6.4,311.45,23,335.83,1055.3499999999999,10546.82,8.15,23,4.37,7.16,11.64]
["ES",2013,"I56","1a",-1,null,null,null,6971798,8558746,3292688,22791,142585,10.62,12789,0,0,0.11,249.2,16368,-806.83,211.44,1126.31,2.5299999999999998,21866,-6.61,1.33,5.96]
["ES",2013,"I56","1b",-1,null,null,null,453212,787439,382130,39,16163,3.81,37,null,null,null,894.97,36,null,null,null,7,39]
["ES",2013,"J",0,-1,46.79,null,74.17,74859376,56216010,23947641,16273,251966,5.34,10471,0,0,0.78,1459.83,9890,-314.69,483.55,3407.48,22.46,15310,-4.47,4.58,15.72]
["ES",2013,"J",1,-1,null,null,null,11265110,9827635,4940109,16179,114748,11.26,10385,0,0,0.74,760.41,9807,-327.10000000000002,477.71,3391.69,7.78,15216,-4.54,4.53,15.69]
["ES",2013,"J",2,-1,null,null,null,63594265,46388374,19007532,94,137218,4.97,86,0.32,3.51,21.36,1551.92,83,314.89999999999998,1243.3,5732.86,25.57,94,4.62,9.24,24.64]
["ES",2013,"J","1a",-1,null,null,null,7306108,5921150,2971752,15978,73806,11.25,10217,0,0,0.68,704.15,9637,-344.53,469.31,3334.5,7.06,15015,-4.78,4.49,15.72]
["ES",2013,"J","1b",-1,null,null,null,3959001,3906485,1968356,201,40942,11.27,168,0.1,1.58,7.62,841.55,170,222.98,1157.6300000000001,11992.16,8.8699999999999992,201,1.88,6.31,12.9]
["ES",2013,"J58",0,-1,37.24,null,47.29,4574736,2858958,1035710,2323,17927,44.74,1380,0,0,1.31,326.55,1460,-765.3,292.95,2528.06,10.82,2219,-8.7200000000000006,3.1,12.57]
["ES",2013,"J58",1,-1,null,null,null,1983196,1450389,545831,2307,12579,25.53,1366,0,0,1.21,400.96,1446,-788.46,291.45999999999998,2612.73,4.32,2203,-9.06,3.09,12.56]
["ES",2013,"J58",2,-1,null,null,null,2591539,1408568,489878,16,5348,49.62,14,14.6,28.1,54.01,311.95,14,131.63,346.93,495.61,17.53,16,2.7,6.79,21.58]
["ES",2013,"J58","1a",-1,null,null,null,1470459,970336,369999,2281,9453,25.46,1352,0,0,1.1200000000000001,438.37,1424,-793.38,292.95,2531.61,4.51,2177,-9.24,3.09,12.63]
["ES",2013,"J58","1b",-1,null,null,null,512736,480052,175831,26,3126,25.71,14,0.78,4.78,16.53,334.48,22,-485.66,94.7,9506.25,3.91,26,-4.0199999999999996,1.82,7.91]
["ES",2013,"J59",0,-1,35.619999999999997,null,35.35,4726868,3624677,603463,1904,11784,43.76,1185,0,0,0.64,277.39,1147,-340.21,464.95,3985.65,6.67,1778,-7.55,6.45,21.19]
["ES",2013,"J59",1,-1,null,null,null,1476829,988690,437351,1898,8354,6.88,1181,0,0,0.62,965.9,1142,-343.47,502.51,4064.8,11.56,1772,-7.55,6.48,21.23]
["ES",2013,"J59",2,-1,null,null,null,3250039,2635987,166112,6,3430,null,4,null,null,null,null,5,null,null,null,4.84,6,null,1.4]
["ES",2013,"J59","1a",-1,null,null,null,1037007,626570,249578,1879,5622,9.2799999999999994,1167,0,0,0.54,651.9,1124,-378.31,463.47,3970.73,9.56,1753,-7.99,6.44,21.2]
["ES",2013,"J59","1b",-1,null,null,null,439822,362120,187772,19,2732,4.25,14,null,null,null,2060.25,18,null,null,null,15.01,19]
["ES",2013,"J60",0,-1,27.78,null,30.85,3556770,1578641,466853,447,4190,25.48,235,0,0,1.08,1238.6099999999999,303,-1736.4,154.41999999999999,1727.26,21.24,423,-19.77,1.86,15.21]
["ES",2013,"J60",1,-1,null,null,null,382287,199444,71444,444,2174,47.32,232,0,0,1.04,309.67,300,-1746.69,144.44999999999999,1713.63,2.71,420,-19.84,1.63,14.94]
["ES",2013,"J60",2,-1,null,null,null,null,null,null,3,null,null,3,null,null,null,null,3,null,null,null,null,3]
["ES",2013,"J60","1a",-1,null,null,null,259923,114705,52689,439,1889,-170.69,228,0,0,1.04,-67.599999999999994,296,-1746.69,133.22,1581.64,-0.97,415,-19.88,1.24,14.96]
["ES",2013,"J60","1b",-1,null,null,null,null,null,null,5,null,null,4,null,null,null,null,4,null,null,null,null,5]
["ES",2013,"J61",0,-1,100,null,100,41539643,29070130,13137414,1416,57942,0.31,890,0,0,0.54,2102.39,904,-526.69000000000005,520.12,2984.83,33.61,1337,-6.22,3.76,13.85]
["ES",2013,"J61",1,-1,null,null,null,1252036,1165279,454176,1390,11182,5.77,864,0,0,0.47,980.34,881,-664,480.29,2883.01,9.52,1311,-6.67,3.57,13.21]
["ES",2013,"J61",2,-1,null,null,null,40287607,27904851,12683238,26,46760,0.26,26,0.13,0.37,1.57,2130.44,23,773.96,1354.72,9023.93,34.619999999999997,26,8.4499999999999993,21.11,42.3]
["ES",2013,"J61","1a",-1,null,null,null,570620,554670,232651,1356,6961,9.3800000000000008,832,0,0,0.43,652.13,853,-721.03,462.87,2752.93,5.68,1277,-7.3,3.41,13.09]
["ES",2013,"J61","1b",-1,null,null,null,null,null,null,34,null,null,32,null,null,null,null,28,null,null,null,null,34]
["ES",2013,"J62",0,-1,52.61,null,80.88,14912116,14890041,7720250,8612,148698,14.14,5797,0,0,0.75,1118.02,5194,-113.26,571.30999999999995,3595.94,8.7200000000000006,8117,-2,4.7300000000000004,15.04]
["ES",2013,"J62",1,-1,null,null,null,5289447,5311450,3040794,8574,70750,12.25,5763,0,0,0.72,733.38,5161,-115.98,566.30999999999995,3570.27,7.26,8079,-2.06,4.71,15.05]
["ES",2013,"J62",2,-1,null,null,null,9622669,9578591,4679456,38,77948,15.01,34,0.68,4.62,16.12,1437.42,33,211.4,2006.9,7001.52,9.5299999999999994,38,3.91,5.88,10.47]
["ES",2013,"J62","1a",-1,null,null,null,3313643,3205006,1840245,8471,44194,8.14,5672,0,0,0.66,825.34,5075,-126.46,560.55999999999995,3532.84,7.5,7976,-2.2400000000000002,4.7,15.2]
["ES",2013,"J62","1b",-1,null,null,null,1975803,2106443,1200548,103,26556,19.04,91,0.11,1.78,7.22,619.29999999999995,86,290.31,1157.6300000000001,5840.38,6.9,103,2.39,5.94,11.68]
["ES",2013,"J63",0,-1,85.61,null,69.849999999999994,5549245,4193561,983948,1571,11425,19.68,984,0,0,0.87,893.85,882,-566.84,445.48,3972.32,15.96,1436,-5.55,4.8600000000000003,19.05]
["ES",2013,"J63",1,-1,null,null,null,881317,712382,390510,1566,9709,7.21,979,0,0,0.85,1153.77,877,-571.54,436.94,3843.16,12,1431,-5.61,4.8,19]
["ES",2013,"J63",2,-1,null,null,null,null,null,null,5,null,null,5,null,null,null,null,5,null,null,null,null,5]
["ES",2013,"J63","1a",-1,null,null,null,654457,449861,226587,1552,5687,13.56,966,0,0,0.86,952.66,865,-627.41999999999996,431.85,3678.54,9.66,1417,-5.78,4.6900000000000004,18.989999999999998]
["ES",2013,"J63","1b",-1,null,null,null,226860,262521,163923,14,4022,0.66,13,null,null,null,1475.31,12,null,null,null,16.03,14]
["ES",2013,"K642",0,-1,89.03,null,25.54,80847515,74837,78117,755,766,98.4,540,0.61,80.77,102.65,169.54,449,-0.2,327.58,3350.93,null,503]
["ES",2013,"L",0,-1,41.24,null,52.25,118395204,7096721,4128215,38499,52029,25.93,28388,0,0.02,4.6900000000000004,239,26920,49.83,431.16,2106.1799999999998,48.92,30149,2.34,37.92,74.209999999999994]
["ES",2013,"L",1,-1,null,null,null,86100175,5310388,3739312,38475,48031,16,28371,0,0.02,4.67,449.13,26899,49.84,431.29,2107.2399999999998,51.96,30127,2.34,37.89,74.2]
["ES",2013,"L",2,-1,null,null,null,32295029,1786333,388903,24,3998,64.37,17,4.58,21.74,62.69,85.02,21,13.75,93.57,395.18,39.9,22,4.34,92.58,150.47]
["ES",2013,"L","1a",-1,null,null,null,76225533,4495114,3241420,38388,45315,16.84,28291,0,0.02,4.6399999999999997,509.34,26819,49.46,431.28,2106.58,51.83,30044,2.2999999999999998,37.78,74.13]
["ES",2013,"L","1b",-1,null,null,null,9874641,815273,497891,87,2716,11.39,80,0.41,3.96,20.66,273.56,80,175.61,443.58,2351.5100000000002,52.64,83,40.76,69.73,83.29]
["ES",2013,"L68",0,-1,41.24,null,52.25,118395204,7096721,4128215,38499,52029,25.93,28388,0,0.02,4.6900000000000004,239,26920,49.83,431.16,2106.1799999999998,48.92,30149,2.34,37.92,74.209999999999994]
["ES",2013,"L68",1,-1,null,null,null,86100175,5310388,3739312,38475,48031,16,28371,0,0.02,4.67,449.13,26899,49.84,431.29,2107.2399999999998,51.96,30127,2.34,37.89,74.2]
["ES",2013,"L68",2,-1,null,null,null,32295029,1786333,388903,24,3998,64.37,17,4.58,21.74,62.69,85.02,21,13.75,93.57,395.18,39.9,22,4.34,92.58,150.47]
["ES",2013,"L68","1a",-1,null,null,null,76225533,4495114,3241420,38388,45315,16.84,28291,0,0.02,4.6399999999999997,509.34,26819,49.46,431.28,2106.58,51.83,30044,2.2999999999999998,37.78,74.13]
["ES",2013,"L68","1b",-1,null,null,null,9874641,815273,497891,87,2716,11.39,80,0.41,3.96,20.66,273.56,80,175.61,443.58,2351.5100000000002,52.64,83,40.76,69.73,83.29]
["ES",2013,"M",0,-1,44.37,null,61.32,458646325,29094383,14841435,59822,313710,90.82,40489,0,0,1.59,282.07,37004,-166.94,515.71,3231.58,80.010000000000005,56214,-2.44,5.97,19.62]
["ES",2013,"M69",0,-1,42.85,null,53.96,9493555,5997795,3167726,19675,71908,16.48,14338,0,0.01,1.8,930.2,12193,46.19,649.37,3547.68,11.76,18922,0.06,6.15,16.86]
["ES",2013,"M69",1,-1,null,null,null,8445963,4332620,2353947,19663,61494,19.98,14326,0,0.01,1.8,864.79,12181,45.26,648.78,3545.12,11.52,18910,0.06,6.15,16.87]
["ES",2013,"M69",2,-1,null,null,null,null,null,null,12,null,null,12,null,null,null,null,12,null,null,null,null,12]
["ES",2013,"M69","1a",-1,null,null,null,7060044,3830893,2122556,19629,57758,19.899999999999999,14297,0,0.01,1.78,1075.3699999999999,12151,44.94,648.82000000000005,3538.11,11.82,18876,0.05,6.15,16.86]
["ES",2013,"M69","1b",-1,null,null,null,1385918,501726,231390,34,3736,20.71,29,null,null,null,297.89999999999998,30,null,null,null,9.2799999999999994,34]
["ES",2013,"M70",0,-1,65.73,null,74.53,413724149,4089853,3235739,9379,54339,101.03,6454,0,0.01,6.26,259.83,5450,-35.369999999999997,605.70000000000005,4744.6400000000003,498.07,8321,-0.81,9.26,33.26]
["ES",2013,"M701",0,-1,55.51,null,86.68,402747101,1641430,1911139,1158,26818,102.26,858,0.31,62.14,106.76,258.32,724,63.02,618.64,5327.11,null,803]
["ES",2013,"M702",0,-1,67.48,null,65.569999999999993,10977049,2448422,1324599,8221,27521,46.05,5596,0,0,2.12,351.57,4726,-71.5,603.95000000000005,4696.87,18.25,7518,-1.19,8.33,28.9]
["ES",2013,"M702",1,-1,null,null,null,7738029,1934273,999722,8213,21192,39.119999999999997,5588,0,0,2.12,620.24,4719,-71.930000000000007,603.09,4696.38,16.760000000000002,7510,-1.2,8.33,28.9]
["ES",2013,"M702",2,-1,null,null,null,null,null,null,8,null,null,8,null,null,null,null,7,null,null,null,null,8]
["ES",2013,"M702","1a",-1,null,null,null,6059532,1617766,850361,8187,18746,36.21,5566,0,0,2.04,962.52,4698,-72.77,604.9,4712.3,17.09,7485,-1.23,8.33,28.9]
["ES",2013,"M702","1b",-1,null,null,null,1678497,316507,149361,26,2446,56.03,22,null,null,null,202.95,21,null,null,null,15.1,25]
["ES",2013,"M71",0,-1,28.85,null,50.33,20257963,9109839,4140244,12026,78025,27.37,7463,0,0,1.38,495.12,7825,-575.66,347.37,2353.7800000000002,12.25,11397,-10.76,4.96,19.3]
["ES",2013,"M71",1,-1,null,null,null,6578886,4066234,1926863,11995,44493,26.17,7436,0,0,1.32,636.16,7797,-580.54,345.34,2337.6799999999998,8.4600000000000009,11367,-10.83,4.93,19.3]
["ES",2013,"M71",2,-1,null,null,null,13679077,5043605,2213381,31,33532,27.9,27,3.37,11.63,19.989999999999998,450.58,28,388.13,2069.35,3606.14,15.3,30,4.6399999999999997,10.76,18.21]
["ES",2013,"M71","1a",-1,null,null,null,5275483,2863299,1371008,11937,33338,22.01,7385,0,0,1.29,507.76,7745,-589.6,339.55,2307.27,7.47,11309,-10.98,4.88,19.309999999999999]
["ES",2013,"M71","1b",-1,null,null,null,1303403,1202934,555854,58,11155,33.020000000000003,51,0.2,2.37,9.4700000000000006,1089.17,52,376.03,1400,6586.81,10.81,58,3.76,7.09,15.85]
["ES",2013,"M72",0,-1,43.29,null,76.28,2219092,913166,498159,913,8360,8.14,574,0,0.02,1.28,530.28,537,-399.42,511.93,3596.7,8.6300000000000008,806,-5.28,7.26,25.81]
["ES",2013,"M72",1,-1,null,null,null,1560464,417850,269564,909,5497,9.5500000000000007,570,0,0.01,1.23,489.78,533,-489.89,511.93,3596.7,9.61,802,-6,7.28,25.9]
["ES",2013,"M72",2,-1,null,null,null,null,null,null,4,null,null,4,null,null,null,null,4,null,null,null,null,4]
["ES",2013,"M72","1a",-1,null,null,null,775260,302595,199336,901,4487,12.95,564,0,0.01,1.23,479.9,526,-506.1,515.39,3585.2,9.42,794,-6.63,7.25,26.11]
["ES",2013,"M72","1b",-1,null,null,null,785203,115254,70228,8,1010,1.36,6,null,null,null,516.13,7,null,null,null,10.15,8]
["ES",2013,"M73",0,-1,22.74,null,46.46,3932830,4408428,1468477,5474,47178,10.29,3532,0,0,0.73,1042.1600000000001,3432,-309.44,451.14,3294.8,6.69,5167,-4.45,4.26,14.94]
["ES",2013,"M73",1,-1,null,null,null,2772029,2725598,988769,5463,28386,16.43,3522,0,0,0.72,913.6,3421,-312.48,449.87,3272.49,6.3,5156,-4.46,4.26,14.96]
["ES",2013,"M73",2,-1,null,null,null,1160800,1682830,479707,11,18792,1.77,10,null,1.22,null,1296.79,11,null,10211.86,null,7.33,11,null,4.75]
["ES",2013,"M73","1a",-1,null,null,null,2241667,1935056,734459,5427,20404,19,3491,0,0,0.65,716.02,3400,-318.83,443.77,3229.42,6.33,5120,-4.53,4.28,15]
["ES",2013,"M73","1b",-1,null,null,null,530362,790541,254310,36,7982,10.039999999999999,31,null,null,null,2924.54,21,null,null,null,6.22,36]
["ES",2013,"M74",0,-1,100,null,100,8819764,4358756,2240854,11395,50438,17.13,7510,0,0,0.82,1093.52,6863,-283.52999999999997,475.47,3077.7,16.68,10665,-3.79,5.8,20.93]
["ES",2013,"M74",1,-1,null,null,null,7465685,3730259,1832513,11385,45508,14.57,7502,0,0,0.81,1089.25,6856,-283.60000000000002,475.47,3085.63,13.29,10655,-3.79,5.8,20.93]
["ES",2013,"M74",2,-1,null,null,null,1354079,628497,408341,10,4930,22.59,8,null,2.0499999999999998,null,1102.77,7,null,476.04,null,36.85,10,null,10.42]
["ES",2013,"M74","1a",-1,null,null,null,6207662,2655914,1240351,11330,32225,21.62,7455,0,0,0.8,781.06,6808,-293.37,467.96,3045.86,11.4,10600,-3.85,5.79,20.96]
["ES",2013,"M74","1b",-1,null,null,null,1258022,1074344,592161,55,13283,3.52,47,7.0000000000000007E-2,1.04,5.45,2863.82,48,381.76,1322.3,6977.77,17.95,55,1.6,6.64,17.87]
["ES",2013,"M75",0,-1,62.87,null,68.45,199015,216545,90190,960,3462,5.39,618,0,0,0.2,363.53,704,-573.49,348.26,1694.78,3.68,936,-4.4400000000000004,3.41,9.4]
["ES",2013,"M75",1,-1,null,null,null,199015,216545,90190,960,3462,5.39,618,0,0,0.2,363.53,704,-573.49,348.26,1694.78,3.68,936,-4.4400000000000004,3.41,9.4]
["ES",2013,"M75",2,-1,null,null,null,null,null,null,0,null,null,0,null,null,null,null,0,null,null,null,null,0]
["ES",2013,"M75","1a",-1,null,null,null,199015,216545,90190,960,3462,5.39,618,0,0,0.2,363.53,704,-573.49,348.26,1694.78,3.68,936,-4.4400000000000004,3.41,9.4]
["ES",2013,"M75","1b",-1,null,null,null,null,null,null,0,null,null,0,null,null,null,null,0,null,null,null,null,0]
["ES",2013,"MC",0,-1,44.19,null,59.69,55899225,27452952,12930296,58664,286892,23.17,39631,0,0,1.35,623.59,36280,-176.24,514.76,3209.81,12.27,55411,-2.5,5.87,19.16]
["ES",2013,"MC",1,-1,null,null,null,34760028,17423380,8461614,58588,210032,22.28,39562,0,0,1.33,787.6,36211,-178.39,513.52,3201.83,10.79,55336,-2.5099999999999998,5.87,19.170000000000002]
["ES",2013,"MC",2,-1,null,null,null,21139196,10029572,4468681,76,76860,24.65,69,0.25,3.08,12.51,495.94,69,393.09,1723.19,6661.4,14.9,75,3.65,7.8,16.82]
["ES",2013,"MC","1a",-1,null,null,null,27818624,13422071,6608307,58371,170420,23.48,39376,0,0,1.3,793.68,36032,-182.77,512.09,3192.38,10.46,55120,-2.56,5.87,19.18]
["ES",2013,"MC","1b",-1,null,null,null,6941407,4001309,1853307,217,39612,18.73,186,0.15,2.31,13.65,770.2,179,207.08,801.11,6641.14,11.9,216,2.31,6.27,16.95]
["ES",2013,"N",0,-1,22.7,null,62.38,31464938,28598966,16879013,20045,636033,18.850000000000001,13177,0,0,1.1000000000000001,652.75,13364,-186.59,392.62,2061.48,10.4,18734,-3.47,4.1100000000000003,15.47]
["ES",2013,"N",1,-1,null,null,null,17330660,11843599,6727150,19955,282462,25.53,13094,0,0,1.06,478.45,13280,-191.61,389.59,2061.9499999999998,7.85,18645,-3.57,4.0999999999999996,15.49]
["ES",2013,"N",2,-1,null,null,null,14134277,16755366,10151862,90,353571,15.88,83,0.38,1.8,8.6300000000000008,783.03,84,249.84,686.06,1833.3,12.22,89,2.1,5.43,9.32]
["ES",2013,"N","1a",-1,null,null,null,12917233,7752980,4041234,19750,158056,20.45,12909,0,0,0.98,518.83000000000004,13103,-201.66,387.79,2068.1999999999998,7.64,18440,-3.79,4.0999999999999996,15.52]
["ES",2013,"N","1b",-1,null,null,null,4413427,4090619,2685915,205,124406,34.5,185,0.34,2.92,10.77,421.15,177,194.79,507.32,1496.84,8.25,205,1.68,4.21,12.59]
["ES",2013,"N77",0,-1,23.64,null,46.37,9067372,3529183,1819599,3556,18698,6.34,2307,0,0,0.53,689.74,2667,-217.05,394,1505.73,36.450000000000003,3265,-7.59,8.9700000000000006,28.63]
["ES",2013,"N77",1,-1,null,null,null,4438538,1552136,673546,3545,14098,18.45,2296,0,0,0.51,394.87,2656,-220.02,388.55,1505.3,18.98,3254,-7.63,8.89,28.42]
["ES",2013,"N77",2,-1,null,null,null,4628834,1977047,1146053,11,4600,2.74,11,null,0.81,null,886.33,11,null,836.92,null,50.16,11,null,53.34]
["ES",2013,"N77","1a",-1,null,null,null,3275549,1246644,555057,3529,12872,8.9,2280,0,0,0.51,454.01,2641,-232.78,387.49,1516.82,15.26,3238,-7.81,8.81,28.42]
["ES",2013,"N77","1b",-1,null,null,null,null,null,null,16,null,null,16,null,null,null,null,15,null,null,null,null,16]
["ES",2013,"N78",0,-1,21.5,null,75,1103996,2652819,2430950,550,120316,32.54,375,0,0.06,1.77,635.63,358,-47.79,388.2,2095.36,3.21,513,-1.0900000000000001,3.42,10.91]
["ES",2013,"N78",1,-1,null,null,null,414747,901676,787809,539,42532,5.52,365,0,0.04,1.71,501.97,347,-71.34,375.58,2083.5300000000002,3.44,502,-1.31,3.52,11.03]
["ES",2013,"N78",2,-1,null,null,null,689249,1751143,1643141,11,77784,48.02,10,null,2.2200000000000002,null,750.05,11,null,477.44,null,3.09,11,null,2.5]
["ES",2013,"N78","1a",-1,null,null,null,207052,313317,243907,512,10762,11.72,341,0,0.02,1.36,516.84,321,-118.39,375.58,2361.88,4.21,475,-2.02,3.73,11.71]
["ES",2013,"N78","1b",-1,null,null,null,207695,588359,543902,27,31770,0.94,24,null,null,null,491.52,26,null,null,null,3.03,27]
["ES",2013,"N79",0,-1,40.58,null,54.45,2712768,7250566,899678,2792,21860,33.99,1722,0,0.01,2.5099999999999998,780.73,1778,-348.57,221.43,1251.6099999999999,3.34,2599,-3.93,1.45,7.28]
["ES",2013,"N79",1,-1,null,null,null,983682,2160473,312951,2778,9457,66.78,1711,0,0.01,2.36,375.85,1766,-348.57,221.43,1244.73,2.46,2585,-3.99,1.44,7.27]
["ES",2013,"N79",2,-1,null,null,null,1729085,5090092,586727,14,12403,24.8,11,null,3.73,null,1120.0999999999999,12,-209.1,221.03,2060.3000000000002,3.71,14,0.11,2.86,10.039999999999999]
["ES",2013,"N79","1a",-1,null,null,null,802117,1524546,255790,2746,7678,14.56,1685,0,0.01,2.21,380.66,1743,-354.24,218.25,1243.52,2.12,2553,-4.09,1.43,7.33]
["ES",2013,"N79","1b",-1,null,null,null,181565,635926,57160,32,1779,147.76,26,null,null,null,368.65,23,null,null,null,3.27,32]
["ES",2013,"N80",0,-1,43.41,null,79.88,2085125,2523102,2600606,738,87684,5.58,512,0,0.01,1.29,884.97,520,35.36,415.46,1720.16,10.53,703,-0.98,3.9,10.39]
["ES",2013,"N80",1,-1,null,null,null,622705,876555,649693,726,24330,15.98,502,0,0.01,1.17,393.89,509,29.95,419.41,1765.58,3.93,692,-1.1299999999999999,3.9,10.43]
["ES",2013,"N80",2,-1,null,null,null,1462420,1646547,1950913,12,63354,4.03,10,null,6.86,null,1086.8,11,null,326.33,null,14.04,11,null,5.55]
["ES",2013,"N80","1a",-1,null,null,null,392320,451109,299922,708,11167,7.01,486,0,0.01,1.05,412.2,493,12.51,428.44,1799.92,4.8099999999999996,674,-1.56,3.99,10.57]
["ES",2013,"N80","1b",-1,null,null,null,230385,425445,349771,18,13163,31.29,16,null,null,null,366.14,16,null,null,null,2.99,18]
["ES",2013,"N81",0,-1,35.17,null,63.71,5370184,7295314,5941571,5079,278714,8.2899999999999991,3347,0,0,0.44,629.98,3629,-223.68,405.8,2061.6,5.6,4914,-3.32,3.31,9.19]
["ES",2013,"N81",1,-1,null,null,null,2492271,3229250,2497691,5061,129499,9.6199999999999992,3329,0,0,0.41,517.79999999999995,3611,-228.41,404.73,2074.29,4.8,4896,-3.39,3.3,9.1999999999999993]
["ES",2013,"N81",2,-1,null,null,null,2877913,4066064,3443880,18,149215,7.47,18,0.27,3.97,14.23,726.18,18,329.91,525.53,1224.24,6.23,18,2.37,5.18,6.73]
["ES",2013,"N81","1a",-1,null,null,null,1746169,2155715,1611591,5009,79747,8.39,3281,0,0,0.35,491.93,3561,-249.07,397.58,2078.2600000000002,4.5999999999999996,4844,-3.65,3.28,9.2100000000000009]
["ES",2013,"N81","1b",-1,null,null,null,746102,1073535,886099,52,49752,11.81,48,1.32,3.53,8.81,571.15,50,214.4,611.96,1297.51,5.2,52,2.11,3.85,7.43]
["ES",2013,"N82",0,-1,15.38,null,46.98,11125498,5347980,3186608,7330,108761,46.84,4914,0,0,1.9,531.30999999999995,4412,-98.06,473.12,3138.95,12.93,6740,-2.5499999999999998,5.98,22.03]
["ES",2013,"N82",1,-1,null,null,null,8378722,3123507,1805460,7306,62546,34.880000000000003,4891,0,0,1.89,596.95000000000005,4391,-101.75,471.52,3139.34,11.63,6716,-2.59,5.97,22.08]
["ES",2013,"N82",2,-1,null,null,null,2746775,2224472,1381148,24,46215,60.07,23,0.02,0.8,4.22,473.72,21,452.42,946.55,2420.35,14.76,24,3.38,6.4,8.66]
["ES",2013,"N82","1a",-1,null,null,null,6494031,2061646,1074965,7246,35830,37.51,4836,0,0,1.8,659.9,4344,-111.37,466.76,3136.42,11.48,6656,-2.79,5.92,22.14]
["ES",2013,"N82","1b",-1,null,null,null,1884691,1061861,730494,60,26716,29.97,55,0.09,2.31,12.71,506.74,47,269.67,1308.79,3612.07,11.92,60,4.6399999999999997,8.9,18.36]
["ES",2013,"P",0,-1,31.33,null,33.229999999999997,4232866,3253013,2204074,8509,71505,8.8699999999999992,5284,0,0,0.3,921.36,5389,-554.35,367.37,2359.3000000000002,11.71,8089,-5.82,3.73,13.29]
["ES",2013,"P",1,-1,null,null,null,3539464,2916293,1993742,8506,68902,7.59,5281,0,0,0.28999999999999998,710.38,5386,-555.17999999999995,367.22,2358.3000000000002,8.86,8086,-5.84,3.73,13.29]
["ES",2013,"P",2,-1,null,null,null,null,null,null,3,null,null,3,null,null,null,null,3,null,null,null,null,3]
["ES",2013,"P","1a",-1,null,null,null,2853191,2413596,1655901,8477,59141,8,5254,0,0,0.28000000000000003,759.72,5363,-573.59,364.81,2357.31,8.4700000000000006,8057,-5.99,3.71,13.24]
["ES",2013,"P","1b",-1,null,null,null,686272,502697,337840,29,9761,6.05,27,null,null,null,570.14,23,null,null,null,10.74,29]
["ES",2013,"P85",0,-1,31.33,null,33.229999999999997,4232866,3253013,2204074,8509,71505,8.8699999999999992,5284,0,0,0.3,921.36,5389,-554.35,367.37,2359.3000000000002,11.71,8089,-5.82,3.73,13.29]
["ES",2013,"P85",1,-1,null,null,null,3539464,2916293,1993742,8506,68902,7.59,5281,0,0,0.28999999999999998,710.38,5386,-555.17999999999995,367.22,2358.3000000000002,8.86,8086,-5.84,3.73,13.29]
["ES",2013,"P85",2,-1,null,null,null,null,null,null,3,null,null,3,null,null,null,null,3,null,null,null,null,3]
["ES",2013,"P85","1a",-1,null,null,null,2853191,2413596,1655901,8477,59141,8,5254,0,0,0.28000000000000003,759.72,5363,-573.59,364.81,2357.31,8.4700000000000006,8057,-5.99,3.71,13.24]
["ES",2013,"P85","1b",-1,null,null,null,686272,502697,337840,29,9761,6.05,27,null,null,null,570.14,23,null,null,null,10.74,29]
["ES",2013,"Q",0,-1,51.56,null,58.11,14053317,11846719,6587737,14493,192782,7.85,11427,0,0,0.44,518.83000000000004,9819,219.32,948.49,4373.82,13.1,14036,1.79,8.5399999999999991,19.38]
["ES",2013,"Q",1,-1,null,null,null,8893787,7986945,4437119,14459,136618,5.22,11395,0,0,0.43,902.62,9785,219.1,949.52,4384.66,12.22,14002,1.77,8.5399999999999991,19.38]
["ES",2013,"Q",2,-1,null,null,null,5159530,3859774,2150618,34,56164,12.32,32,0.36,4.01,10.41,301.52999999999997,34,245.76,508.16,2538.06,14.92,34,6.54,10.46,18.36]
["ES",2013,"Q","1a",-1,null,null,null,6322423,5704527,3045169,14352,94885,4.3899999999999997,11290,0,0,0.39,929.54,9682,216.65,946.24,4386.17,11.96,13895,1.71,8.51,19.38]
["ES",2013,"Q","1b",-1,null,null,null,2571364,2282417,1391949,107,41733,7.15,105,0.19,1.55,6.75,845.8,103,464.07,1304.32,4150.9799999999996,12.88,107,6.98,12.3,19.190000000000001]
["ES",2013,"Q86",0,-1,53.59,null,59.28,9542049,8697656,4297568,12410,102912,8.08,9891,0,0,0.41,585.52,8156,253.66,1094.76,5054.29,12.83,12012,2.12,9.06,20.6]
["ES",2013,"Q86",1,-1,null,null,null,6263838,5951657,2932776,12384,72563,5.8,9867,0,0,0.4,1195.71,8130,254,1097.1600000000001,5084.72,12.86,11986,2.11,9.06,20.61]
["ES",2013,"Q86",2,-1,null,null,null,3278211,2745999,1364792,26,30349,13.04,24,0.36,2.42,7.38,277.14,26,245.76,613.59,2538.06,12.78,26,6.61,11.27,18.95]
["ES",2013,"Q86","1a",-1,null,null,null,4529011,4275873,2014989,12308,51255,4.8899999999999997,9792,0,0,0.37,1202.28,8058,249.92,1088.33,5068.6400000000003,12.7,11910,2.08,9.01,20.63]
["ES",2013,"Q86","1b",-1,null,null,null,1734826,1675783,917786,76,21308,8.0399999999999991,75,0.15,1.42,6.93,1179.97,72,693.97,1986.35,6287.46,13.26,76,7.38,12.17,17.66]
["ES",2013,"Q87",0,-1,43.57,null,68,3959899,2586535,1827131,1283,66412,7.54,1027,0,0.01,0.68,394.93,1091,181.94,577.41,1989.51,15.55,1249,1.91,7.9,15.29]
["ES",2013,"Q87",1,-1,null,null,null,2159583,1529455,1076186,1276,41883,2.91,1020,0,0.01,0.65,483.6,1084,180.65,583.39,2008.1,11.85,1242,1.9,7.9,15.28]
["ES",2013,"Q87",2,-1,null,null,null,1800316,1057080,750945,7,24529,11.34,7,null,6.21,null,343.34,7,null,337.7,null,20.92,7,null,10.06]
["ES",2013,"Q87","1a",-1,null,null,null,1575385,1134630,790441,1257,31270,2.09,1002,0,0.01,0.6,494.92,1065,177,584.02,2017.98,11.07,1223,1.81,7.62,15.15]
["ES",2013,"Q87","1b",-1,null,null,null,584198,394825,285745,19,10613,4.76,18,null,null,null,459.85,19,null,null,null,14.08,19]
["ES",2013,"Q88",0,-1,39.799999999999997,null,38.770000000000003,551371,562527,463037,800,23458,4.3099999999999996,509,0,0,0.32,505.52,572,-193.22,356.07,1613.84,6.06,775,-4.47,2.72,9.35]
["ES",2013,"Q88",1,-1,null,null,null,470368,505832,428156,799,22172,4.25,508,0,0,0.32,447.35,571,-194.14,355.62,1591.58,5.94,774,-4.4800000000000004,2.72,9.35]
["ES",2013,"Q88",2,-1,null,null,null,null,null,null,1,null,null,1,null,null,null,null,1,null,null,null,null,1]
["ES",2013,"Q88","1a",-1,null,null,null,218028,294024,239738,787,12360,5.6,496,0,0,0.24,480.36,559,-214.95,352.03,1614.24,4.6900000000000004,762,-4.7300000000000004,2.68,9.35]
["ES",2013,"Q88","1b",-1,null,null,null,252339,211808,188417,12,9812,3.11,12,null,null,null,422.7,12,null,null,null,7.67,12]
["ES",2013,"R",0,-1,34.39,null,30.09,7431190,4871342,1677468,9344,47527,11,5571,0,0,0.43,525.04999999999995,6214,-543.11,336.48,2197.84,10.24,8730,-10.02,4.24,15.45]
["ES",2013,"R",1,-1,null,null,null,6347508,4233184,1420360,9337,43504,11.54,5564,0,0,0.42,536.67999999999995,6207,-545.25,335.79,2196.9899999999998,8.85,8723,-10.029999999999999,4.24,15.41]
["ES",2013,"R",2,-1,null,null,null,1083681,638157,257108,7,4023,9.3699999999999992,7,null,4.5999999999999996,null,492.81,7,null,1597.97,null,19.440000000000001,7,null,17.78]
["ES",2013,"R","1a",-1,null,null,null,5235622,3214376,1171061,9274,38036,9.1199999999999992,5508,0,0,0.38,471.33,6149,-557.24,327,2151.09,8.25,8660,-10.09,4.1900000000000004,15.39]
["ES",2013,"R","1b",-1,null,null,null,1111886,1018808,249299,63,5468,17.37,56,0.32,2.48,11.57,807.56,58,470.94,1533.01,5681.79,10.76,63,2.5499999999999998,8.5399999999999991,18.899999999999999]
["ES",2013,"R90",0,-1,29.36,null,17.989999999999998,669459,505596,158009,1905,5487,13.1,1088,0,0,0.22,372.25,1153,-894,316.76,2503.85,4.1900000000000004,1804,-13.26,2.84,15.68]
["ES",2013,"R90",1,-1,null,null,null,669459,505596,158009,1905,5487,13.1,1088,0,0,0.22,372.25,1153,-894,316.76,2503.85,4.1900000000000004,1804,-13.26,2.84,15.68]
["ES",2013,"R90",2,-1,null,null,null,null,null,null,0,null,null,0,null,null,null,null,0,null,null,null,null,0]
["ES",2013,"R90","1a",-1,null,null,null,617486,443011,147504,1901,5263,13.66,1085,0,0,0.22,337.69,1149,-894,316.76,2520.1,3.94,1800,-13.31,2.84,15.72]
["ES",2013,"R90","1b",-1,null,null,null,null,null,null,4,null,null,3,null,null,null,null,4,null,null,null,null,4]
["ES",2013,"R91",0,-1,14.28,null,19.239999999999998,155179,84369,40646,213,1357,3.09,123,0,0,0.1,468.03,132,-287.12,385.22,2151.92,10.42,203,-6.81,2.98,14.78]
["ES",2013,"R91",1,-1,null,null,null,155179,84369,40646,213,1357,3.09,123,0,0,0.1,468.03,132,-287.12,385.22,2151.92,10.42,203,-6.81,2.98,14.78]
["ES",2013,"R91",2,-1,null,null,null,null,null,null,0,null,null,0,null,null,null,null,0,null,null,null,null,0]
["ES",2013,"R91","1a",-1,null,null,null,144400,73272,34107,212,1226,4.51,122,0,0,0.1,343.49,131,-311.31,358.33,2105.88,8.2100000000000009,202,-6.95,2.84,13.79]
["ES",2013,"R91","1b",-1,null,null,null,null,null,null,1,null,null,1,null,null,null,null,1,null,null,null,null,1]
["ES",2013,"R92",0,-1,48.85,null,51.19,2160259,2318324,590819,2301,13253,12.71,1746,0,0,0.91,999.31,1620,137.34,924.28,4833.47,11.08,2125,1.59,9.1999999999999993,19.25]
["ES",2013,"R92",1,-1,null,null,null,1976100,2074222,544197,2298,12481,12.05,1743,0,0,0.91,987.66,1617,136.69999999999999,924.26,4871.53,11.06,2122,1.56,9.1999999999999993,19.3]
["ES",2013,"R92",2,-1,null,null,null,null,null,null,3,null,null,3,null,null,null,null,3,null,null,null,null,3]
["ES",2013,"R92","1a",-1,null,null,null,1462533,1355079,389493,2255,9383,8.42,1703,0,0,0.74,904.64,1578,121.28,918.45,4802.4799999999996,10.94,2079,1.48,9.2200000000000006,19.350000000000001]
["ES",2013,"R92","1b",-1,null,null,null,513566,719143,154704,43,3098,18.690000000000001,40,0.32,3.36,11.57,1186.7,39,570.87,1561.5,9364.9500000000007,11.28,43,2.44,8.57,17.75]
["ES",2013,"R93",0,-1,34.01,null,29.02,4446297,1963050,887993,4925,27430,9.08,2614,0,0,0.3,343.57,3309,-995.43,154.82,1248.8800000000001,10.81,4598,-16.649999999999999,1.95,12.99]
["ES",2013,"R93",1,-1,null,null,null,3546774,1568995,677506,4921,24179,10.93,2610,0,0,0.28999999999999998,295.85000000000002,3305,-1001.68,154.44,1247.3499999999999,7.36,4594,-16.649999999999999,1.93,12.97]
["ES",2013,"R93",2,-1,null,null,null,null,null,null,4,null,null,4,null,null,null,null,4,null,null,null,null,4]
["ES",2013,"R93","1a",-1,null,null,null,3011206,1343013,599956,4906,22164,9.77,2598,0,0,0.27,283.82,3291,-1008.93,151.19,1236.96,6.96,4579,-16.66,1.91,12.94]
["ES",2013,"R93","1b",-1,null,null,null,535568,225982,77550,15,2015,15.87,12,null,null,null,360.96,14,null,null,null,9.73,15]
["ES",2013,"S",0,-1,41.83,null,59.71,4234042,3186543,1575062,10048,58167,12.97,4930,0,0,0.27,630.75,6705,-1966.95,98.61,1061.31,8.0500000000000007,9614,-19.55,0.21,8.83]
["ES",2013,"S",1,-1,null,null,null,3735356,2602333,1353144,10042,53472,12.45,4924,0,0,0.26,539.66,6699,-1975.06,97.01,1057.55,7.26,9608,-19.600000000000001,0.2,8.81]
["ES",2013,"S",2,-1,null,null,null,498685,584209,221918,6,4695,14.77,6,null,2.85,null,1201.24,6,null,11994.84,null,11.6,6,null,18.77]
["ES",2013,"S","1a",-1,null,null,null,3174021,2204198,1116586,10022,48270,12.14,4905,0,0,0.25,409.89,6685,-1980.75,94.23,1047.25,5.71,9588,-19.670000000000002,0.17,8.76]
["ES",2013,"S","1b",-1,null,null,null,561334,398134,236557,20,5202,13.07,19,null,null,null,1459.89,14,null,null,null,15.87,20]
["ES",2013,"S94",0,-1,null,null,null,null,null,null,0,null,null,0,null,null,null,null,0,null,null,null,null,0]
["ES",2013,"S94",1,-1,null,null,null,null,null,null,0,null,null,0,null,null,null,null,0,null,null,null,null,0]
["ES",2013,"S94",2,-1,null,null,null,null,null,null,0,null,null,0,null,null,null,null,0,null,null,null,null,0]
["ES",2013,"S94","1a",-1,null,null,null,null,null,null,0,null,null,0,null,null,null,null,0,null,null,null,null,0]
["ES",2013,"S94","1b",-1,null,null,null,null,null,null,0,null,null,0,null,null,null,null,0,null,null,null,null,0]
["ES",2013,"S95",0,-1,18.690000000000001,null,32.17,528827,835816,347439,1383,9037,12.38,820,0,0,0.33,1389.4,964,-930.14,282.69,1851.3,5.93,1347,-8.69,1.89,6.61]
["ES",2013,"S95",1,-1,null,null,null,346421,490120,225704,1381,7053,4.58,818,0,0,0.32,699.13,962,-938.57,278.12,1842.67,4.62,1345,-8.6999999999999993,1.88,6.59]
["ES",2013,"S95",2,-1,null,null,null,null,null,null,2,null,null,2,null,null,null,null,2,null,null,null,null,2]
["ES",2013,"S95","1a",-1,null,null,null,306266,382508,158150,1377,5374,7.74,814,0,0,0.31,403.26,958,-945.03,271.13,1796.26,3.28,1341,-8.75,1.87,6.58]
["ES",2013,"S95","1b",-1,null,null,null,null,null,null,4,null,null,4,null,null,null,null,4,null,null,null,null,4]
["ES",2013,"S96",0,-1,52.14,null,70.86,3705215,2350727,1227623,8665,49130,13.14,4110,0,0,0.27,557.95000000000005,5741,-2144.7399999999998,40.76,989.08,8.8000000000000007,8267,-21.7,-0.36,9.39]
["ES",2013,"S96",1,-1,null,null,null,3388935,2112213,1127440,8661,46419,13.56,4106,0,0,0.26,523.64,5737,-2151,39.35,988.88,7.88,8263,-21.71,-0.38,9.36]
["ES",2013,"S96",2,-1,null,null,null,null,null,null,4,null,null,4,null,null,null,null,4,null,null,null,null,4]
["ES",2013,"S96","1a",-1,null,null,null,2867755,1821690,958436,8645,42896,12.68,4091,0,0,0.25,410.89,5727,-2182.39,37.229999999999997,984.98,6.22,8247,-21.76,-0.41,9.32]
["ES",2013,"S96","1b",-1,null,null,null,521179,290522,169003,16,3523,15.43,15,null,null,null,1263.48,10,null,null,null,18.28,16]
["ES",2013,"Z0",0,-1,39.31,null,61.57,1792979676,991257372,239910066,483864,4937024,34.69,321133,0,0,1.1599999999999999,477.83,351322,-171.79,330.29,1657.14,11.83,453310,-3.31,3.72,13.48]
["ES",2013,"ZC",0,-1,39.29,null,61.47,1390232576,989615941,237998900,482706,4910206,20.93,320275,0,0,1.1399999999999999,578.84,350598,-172.66,330,1653.11,9.85,452507,-3.31,3.71,13.43]
["ES",2013,"ZC",1,-1,null,null,null,501708416,342990934,104057147,480914,2885982,12.02,318635,0,0,1.1000000000000001,458.83,348914,-177.19,327.60000000000002,1643.61,7.1,450723,-3.38,3.7,13.43]
["ES",2013,"ZC",2,-1,null,null,null,888524327,646625006,133941724,1792,2024224,23.9,1640,0.42,3.25,14.23,634.21,1684,310.39,944.54,3769.42,11.3,1784,2.67,6.44,13.76]
["ES",2013,"ZC","1a",-1,null,null,null,371580080,228234028,73211060,474987,2199805,12.71,313253,0,0,1,424.53,343454,-192.59,321.42,1624.96,6.52,444812,-3.58,3.67,13.49]
["ES",2013,"ZC","1b",-1,null,null,null,130128830,114756905,30846086,5927,686177,10.94,5382,0.24,2.0499999999999998,7.89,525.29999999999995,5460,271.68,731.63,2962.69,8.2799999999999994,5911,2.04,5.05,10.98]
[]
["country","year","sector","size","sample","coverage_firms","coverage_turnover","coverage_employees","total_assets","turnover","gross_value_added","nb_firms","employees","r21_wm","r21_nbq","r21_q1","r21_q2","r21_q3","r22_wm","r22_nbq","r22_q1","r22_q2","r22_q3","r33_wm","r33_nbq","r33_q1","r33_q2","r33_q3"]
["ES",2015,"A",0,1,null,null,null,11638607,6901556,1558783,7844,48678,7.58,5921,0,0.01,0.44,662.23,6032,99.96,588.65,2662.61,8.14,7647,0.64,9.42,25.8]
["ES",2015,"A",1,1,null,null,null,10648864,5159238,1432538,7829,45933,7.04,5908,0,0.01,0.44,658.24,6017,99.11,588.48,2664.34,9.9700000000000006,7632,0.64,9.4600000000000009,25.87]
["ES",2015,"A",2,1,null,null,null,989743,1742317,126245,15,2745,13.42,13,0.45,1.52,6.96,708.59,15,508.54,655.8,2131.15,2.74,15,1.05,3.45,4.8]
["ES",2015,"A","1a",1,null,null,null,9346171,3704287,1177485,7762,39413,7.54,5845,0,0.01,0.42,618.59,5951,94.24,587.32000000000005,2663.19,11.18,7565,0.59,9.5399999999999991,26.03]
["ES",2015,"A","1b",1,null,null,null,1302692,1454951,255052,67,6519,5,63,0.04,0.75,5.1100000000000003,896.24,66,262.92,842.51,2676.25,6.87,67,1.82,3.9,8.58]
["ES",2015,"A01",0,1,null,null,null,10347570,6123070,1262968,7067,41961,7.71,5313,0,0.01,0.43,627.87,5436,91.66,573.85,2613.56,7.92,6895,0.56000000000000005,9.51,26.63]
["ES",2015,"A01",1,1,null,null,null,9554023,4464657,1154176,7053,39570,7.38,5300,0,0.01,0.42,601.30999999999995,5422,89.87,573.73,2616.7199999999998,9.69,6881,0.56000000000000005,9.52,26.68]
["ES",2015,"A01",2,1,null,null,null,793547,1658413,108792,14,2391,10.5,13,0.45,1.52,6.96,991.13,14,564.51,677.7,2342.94,3.14,14,1.4,3.93,4.92]
["ES",2015,"A01","1a",1,null,null,null,8528110,3161178,937713,6995,33857,8.48,5245,0,0.01,0.41,552.64,5365,86.32,569.24,2618.3000000000002,10.77,6823,0.52,9.66,26.83]
["ES",2015,"A01","1b",1,null,null,null,1025913,1303478,216462,58,5712,3.3,55,0.04,0.64,4.29,891.59,57,279.45999999999998,776.81,2540.4,7.07,58,2.11,3.89,8.59]
["ES",2015,"A02",0,1,null,null,null,445640,291228,95502,439,3207,6.01,326,0,0,0.28000000000000003,764.4,316,99.21,603.62,2111.87,6.32,428,0.15,5.91,17.39]
["ES",2015,"A02",1,1,null,null,null,445640,291228,95502,439,3207,6.01,326,0,0,0.28000000000000003,764.4,316,99.21,603.62,2111.87,6.32,428,0.15,5.91,17.39]
["ES",2015,"A02",2,1,null,null,null,null,null,null,0,null,null,0,null,null,null,null,0,null,null,null,null,0]
["ES",2015,"A02","1a",1,null,null,null,385373,218841,74039,435,2620,6.6,322,0,0,0.24,747.29,312,99.21,588.42999999999995,2038.02,7.14,424,0.15,5.94,17.579999999999998]
["ES",2015,"A02","1b",1,null,null,null,null,null,null,4,null,null,4,null,null,null,null,4,null,null,null,null,4]
["ES",2015,"A03",0,1,null,null,null,845417,487256,200311,338,3509,7.02,282,0,0.04,1.1200000000000001,1121.96,280,352.42,1263.6099999999999,4675.57,12.05,324,3.95,12.04,22.06]
["ES",2015,"A03",1,1,null,null,null,649221,403352,182858,337,3155,5.0599999999999996,282,0,0.04,1.1200000000000001,1677.35,279,359.4,1269.0899999999999,4676.54,15.67,323,4.01,12.05,22.06]
["ES",2015,"A03",2,1,null,null,null,null,null,null,1,null,null,0,null,null,null,null,1,null,null,null,null,1]
["ES",2015,"A03","1a",1,null,null,null,432709,324268,165732,332,2935,2.2599999999999998,278,0,0.03,1.01,1783.01,274,367.34,1281.4000000000001,4677.5,17.920000000000002,318,4.07,12.31,22.13]
["ES",2015,"A03","1b",1,null,null,null,null,null,null,5,null,null,4,null,null,null,null,5,null,null,null,null,5]
["ES",2015,"B",0,1,29.82,null,39.299999999999997,4958974,1387679,514802,620,7244,21.98,443,0,0.06,1.99,509.82,496,-40.479999999999997,499.73,1878.29,16.89,604,-2.78,7.78,18.12]
["ES",2015,"B",1,1,null,null,null,2136466,660513,219150,616,4782,32.630000000000003,440,0,0.06,1.87,826.24,493,-59.86,500,1922.14,12.74,600,-2.78,7.75,18.059999999999999]
["ES",2015,"B",2,1,null,null,null,null,null,null,4,null,null,3,null,null,null,null,3,null,null,null,null,4]
["ES",2015,"B","1a",1,null,null,null,1274850,513048,180837,605,4200,10.56,432,0,0.05,1.59,689.85,486,-60.84,496.04,1843.15,10.65,590,-2.78,7.75,18.100000000000001]
["ES",2015,"B","1b",1,null,null,null,861615,147465,38313,11,582,null,8,null,null,null,null,7,null,null,null,null,10]
["ES",2015,"B05",0,1,11.49,null,10.31,230499,28044,9743,10,214,136.5,7,null,null,null,1566.09,6,null,null,null,6.37,9]
["ES",2015,"B05",1,1,null,null,null,230499,28044,9743,10,214,null,7,null,null,null,null,6,null,null,null,null,9]
["ES",2015,"B05",2,1,null,null,null,null,null,null,0,null,null,0,null,null,null,null,0,null,null,null,null,0]
["ES",2015,"B05","1a",1,null,null,null,11910,9396,3052,7,44,null,5,null,null,null,null,5,null,null,null,11.28,7]
["ES",2015,"B05","1b",1,null,null,null,null,null,null,3,null,null,2,null,null,null,null,1,null,null,null,null,2]
["ES",2015,"B06",0,1,21.74,null,0,null,null,null,5,null,null,3,null,null,null,null,3,null,null,null,null,5]
["ES",2015,"B06",1,1,null,null,null,null,null,null,4,null,null,3,null,null,null,null,3,null,null,null,null,4]
["ES",2015,"B06",2,1,null,null,null,null,null,null,1,null,null,0,null,null,null,null,0,null,null,null,null,1]
["ES",2015,"B06","1a",1,null,null,null,null,null,null,4,null,null,3,null,null,null,null,3,null,null,null,null,4]
["ES",2015,"B06","1b",1,null,null,null,null,null,null,0,null,null,0,null,null,null,null,0,null,null,null,null,0]
["ES",2015,"B07",0,1,14.08,null,32.19,975589,212825,89785,10,571,0.41,6,null,null,null,269.08999999999997,6,null,null,null,27.43,9]
["ES",2015,"B07",1,1,null,null,null,8565,294,29,9,1,null,5,null,null,null,null,5,null,null,null,null,8]
["ES",2015,"B07",2,1,null,null,null,null,null,null,1,null,null,1,null,null,null,null,1,null,null,null,null,1]
["ES",2015,"B07","1a",1,null,null,null,8565,294,29,9,1,null,5,null,null,null,null,5,null,null,null,null,8]
["ES",2015,"B07","1b",1,null,null,null,null,null,null,0,null,null,0,null,null,null,null,0,null,null,null,null,0]
["ES",2015,"B08",0,1,31.01,null,42.77,2868725,1016853,373080,573,5978,24.97,413,0,7.0000000000000007E-2,2.0299999999999998,804.38,468,-12.62,505.01,1878.29,18.84,560,-2.59,7.87,18.059999999999999]
["ES",2015,"B08",1,1,null,null,null,1806002,605488,211256,571,4382,27.67,411,0,7.0000000000000007E-2,1.84,929.02,466,-26.89,505.01,1907.52,14.91,558,-2.71,7.82,18.03]
["ES",2015,"B08",2,1,null,null,null,null,null,null,2,null,null,2,null,null,null,null,2,null,null,null,null,2]
["ES",2015,"B08","1a",1,null,null,null,1215308,481494,170436,564,3970,10.9,405,0,0.06,1.7,694.04,461,-59.86,500,1844.94,10.85,551,-2.77,7.75,18.02]
["ES",2015,"B08","1b",1,null,null,null,590693,123994,40820,7,412,null,6,null,null,null,null,5,null,null,null,null,7]
["ES",2015,"B09",0,1,44,null,62.92,90186,24664,-3216,22,151,null,14,0,0,0.02,-2346.9499999999998,13,-5692.99,209.54,1322.16,-31.88,21,-2.8,5.03,25.58]
["ES",2015,"B09",1,1,null,null,null,90186,24664,-3216,22,151,null,14,0,0,0.02,-2346.9499999999998,13,-5692.99,209.54,1322.16,-31.88,21,-2.8,5.03,25.58]
["ES",2015,"B09",2,1,null,null,null,null,null,null,0,null,null,0,null,null,null,null,0,null,null,null,null,0]
["ES",2015,"B09","1a",1,null,null,null,37853,19841,5981,21,151,3.22,14,null,null,null,517.79,12,null,null,null,6.73,20]
["ES",2015,"B09","1b",1,null,null,null,null,null,null,1,null,null,0,null,null,null,null,1,null,null,null,null,1]
["ES",2015,"C",0,1,29.05,null,42.8,214511958,238107035,47300427,30126,683326,11.17,23992,0,0.01,0.52,1117.6500000000001,25304,157.21,608.95000000000005,2645.86,8.85,29760,1.33,5.15,10.84]
["ES",2015,"C",1,1,null,null,null,52543983,50403541,15323154,29634,344700,5.36,23531,0,0.01,0.48,901.03,24831,153.26,593.61,2556.88,8.56,29268,1.28,5.09,10.75]
["ES",2015,"C",2,1,null,null,null,161967982,187703494,31977272,492,338625,12.66,461,0.16,1.35,6.39,1191.3499999999999,473,581.49,2326.48,9949.59,8.93,492,5.14,9.09,15]
["ES",2015,"C","1a",1,null,null,null,29488774,27173293,9241315,28572,243542,3.73,22516,0,0,0.4,740.71,23842,144.44,567.27,2440.94,7.63,28207,1.1399999999999999,4.97,10.61]
["ES",2015,"C","1b",1,null,null,null,23055208,23230247,6081838,1062,101157,6.86,1015,0.06,0.65,3.36,1126.46,989,530.42999999999995,1480.1,5694.56,9.65,1061,4.34,8.1999999999999993,13.2]
["ES",2015,"C10",0,1,28.04,null,39.06,23988701,30389455,5744889,3924,108229,6.22,3283,0,0.01,0.41,1012.59,3308,216.61,753,3087.49,7.93,3883,1.69,4.88,9.76]
["ES",2015,"C10",1,1,null,null,null,8372223,9205569,2138757,3820,53913,3.75,3182,0,0.01,0.36,956.58,3207,211.75,729.03,3003.96,8,3779,1.61,4.83,9.65]
["ES",2015,"C10",2,1,null,null,null,15616478,21183886,3606132,104,54316,7.31,101,0.19,1,3.65,1039.4000000000001,101,543.21,2043.85,9101.19,7.89,104,4,6.87,11.36]
["ES",2015,"C10","1a",1,null,null,null,4045332,4096854,1119589,3588,34913,3.16,2957,0,0,0.24,791.79,2987,201.71,694.69,2826.86,7.55,3547,1.49,4.76,9.36]
["ES",2015,"C10","1b",1,null,null,null,4326890,5108715,1019167,232,18999,4.18,225,0.06,0.67,2.85,1126.04,220,519.13,1275.55,5772.15,8.3699999999999992,232,3.3,6.74,12.11]
["ES",2015,"C11",0,1,22.5,null,32.979999999999997,8637681,6264701,1841112,846,14542,7.5,627,0,0.03,0.56999999999999995,2818.68,689,62.13,495.8,2126.8000000000002,17.5,838,-0.25,8.89,18.53]
["ES",2015,"C11",1,1,null,null,null,2746481,1285009,349183,830,5739,13.43,611,0,0.02,0.49,1085.51,673,40.659999999999997,482.26,1921.74,14.73,822,-0.86,8.64,18.46]
["ES",2015,"C11",2,1,null,null,null,5891200,4979692,1491929,16,8803,6.26,16,0.78,1.7,5.18,4226.72,16,7401.3,22145.78,225467.86,18.22,16,12.29,17.989999999999998,22.43]
["ES",2015,"C11","1a",1,null,null,null,1681117,726546,209674,803,4325,4.12,585,0,0.02,0.43,649.75,649,29.35,466.49,1821.29,11.79,795,-1.79,8.58,18.329999999999998]
["ES",2015,"C11","1b",1,null,null,null,1065364,558462,139508,27,1414,21.13,26,0.24,0.61,2.87,2436.83,24,811.06,1687.95,21477.18,18.55,27,6.28,12.8,19.43]
["ES",2015,"C12",0,1,100,null,100,4556928,900989,389647,9,2187,45.66,7,null,null,null,366.25,8,null,null,null,49.71,9]
["ES",2015,"C12",1,1,null,null,null,null,null,null,5,null,null,3,null,null,null,null,5,null,null,null,null,5]
["ES",2015,"C12",2,1,null,null,null,null,null,null,4,null,null,4,null,null,null,null,3,null,null,null,null,4]
["ES",2015,"C12","1a",1,null,null,null,null,null,null,5,null,null,3,null,null,null,null,5,null,null,null,null,5]
["ES",2015,"C12","1b",1,null,null,null,null,null,null,0,null,null,0,null,null,null,null,0,null,null,null,null,0]
["ES",2015,"C13",0,1,35.72,null,41.46,1753138,1856307,488169,1139,13348,5.74,916,0,0.01,0.86,743.92,965,156.27000000000001,567.24,2178.48,6.59,1130,1.48,4.58,9.33]
["ES",2015,"C13",1,1,null,null,null,1621995,1694628,463298,1137,12853,5.68,914,0,0.01,0.86,739.91,963,155.63,567.24,2176.39,6.72,1128,1.48,4.58,9.35]
["ES",2015,"C13",2,1,null,null,null,null,null,null,2,null,null,2,null,null,null,null,2,null,null,null,null,2]
["ES",2015,"C13","1a",1,null,null,null,1155040,1190088,332095,1111,10306,3.06,888,0,0.01,0.8,562.79,938,150.79,558.5,2083.35,5.55,1102,1.32,4.5,9.25]
["ES",2015,"C13","1b",1,null,null,null,466954,504540,131202,26,2547,9.2899999999999991,26,0.26,0.63,3.18,1307.76,25,536.54999999999995,2004.55,3786.63,9.49,26,4.6500000000000004,7.27,12.24]
["ES",2015,"C14",0,1,22.77,null,42.13,1534082,2088603,459379,875,13450,6.58,612,0,0,0.68,677.8,683,-107.14,274.72000000000003,1280.93,4.34,853,-2.09,3.06,7.63]
["ES",2015,"C14",1,1,null,null,null,794467,821229,221628,862,7863,7.41,606,0,0,0.66,434.5,670,-59.35,275.89999999999998,1288.8399999999999,4.74,840,-2.12,3.08,7.68]
["ES",2015,"C14",2,1,null,null,null,739615,1267374,237750,13,5587,5.96,6,null,1.48,null,1169.57,13,-1080.46,-823.08,645.21,4.09,13,-1.39,-0.42,1.18]
["ES",2015,"C14","1a",1,null,null,null,575215,570139,174558,850,6953,11.56,597,0,0,0.64,353.07,658,-59.35,273.88,1288.8399999999999,3.82,828,-2.27,3.07,7.64]
["ES",2015,"C14","1b",1,null,null,null,219251,251089,47069,12,909,2.14,9,null,null,null,614.61,12,null,null,null,6.82,12]
["ES",2015,"C15",0,1,25.53,null,35.06,1017475,1644774,419876,836,13021,6.34,709,0,0,0.4,1028.76,685,151.32,459.26,2003.3,6.7,822,1.36,3.58,6.9]
["ES",2015,"C15",1,1,null,null,null,907966,1451760,359122,834,11951,4.26,707,0,0,0.4,785.41,683,151.04,455.43,1978.46,5.71,820,1.35,3.56,6.88]
["ES",2015,"C15",2,1,null,null,null,null,null,null,2,null,null,2,null,null,null,null,2,null,null,null,null,2]
["ES",2015,"C15","1a",1,null,null,null,533270,878887,239107,807,9638,2.1,680,0,0,0.32,500.13,659,147.97,446.54,1965.91,3.99,793,1.29,3.5,6.78]
["ES",2015,"C15","1b",1,null,null,null,374696,572873,120015,27,2313,5.84,27,null,null,null,1348.18,24,null,null,null,8.36,27]
["ES",2015,"C16",0,1,29.55,null,40.56,2959498,2448764,634969,1572,15305,10.91,1192,0,0,0.39,614.87,1322,76.510000000000005,406.53,1751.37,7.91,1556,0.3,4.33,8.7899999999999991]
["ES",2015,"C16",1,1,null,null,null,2131116,1619262,449288,1568,12555,10.97,1188,0,0,0.38,445.23,1318,74.2,404.35,1751.37,6.64,1552,0.3,4.3099999999999996,8.75]
["ES",2015,"C16",2,1,null,null,null,null,null,null,4,null,null,4,null,null,null,null,4,null,null,null,null,4]
["ES",2015,"C16","1a",1,null,null,null,1291695,1265157,358886,1549,10782,3.67,1169,0,0,0.36,509.18,1299,68.650000000000006,396.07,1736.8,5.64,1533,0.24,4.28,8.75]
["ES",2015,"C16","1b",1,null,null,null,839420,354104,90402,19,1773,null,19,null,null,null,null,19,null,null,null,null,19]
["ES",2015,"C17",0,1,30.25,null,39.340000000000003,7692242,5678919,1423808,441,16296,13.35,383,0,0.08,1.49,673.37,393,242.94,818.86,3160.41,14.47,435,2.82,5.79,10.62]
["ES",2015,"C17",1,1,null,null,null,1554216,1665168,420571,425,8867,2.72,370,0,0.06,1.31,1187.83,377,252.71,814.9,2950.89,7.84,419,2.82,5.67,10.130000000000001]
["ES",2015,"C17",2,1,null,null,null,6138025,4013751,1003237,16,7428,15.35,13,0.8,5.12,22.23,622.42999999999995,16,154.13,1671.01,5746.82,17.22,16,5.37,14.11,25.07]
["ES",2015,"C17","1a",1,null,null,null,601497,650938,186591,385,4946,3.69,333,0,0.04,1.06,838.45,337,223.83,707.71,2367.0100000000002,7.67,379,2.7,5.63,9.9700000000000006]
["ES",2015,"C17","1b",1,null,null,null,952718,1014229,233979,40,3921,2.12,37,0.12,0.56999999999999995,3.64,1600.65,40,617.83000000000004,2889.18,8796.74,7.96,40,3.8,6.73,11.34]
["ES",2015,"C18",0,1,26.79,null,41.92,2787577,2241852,876878,2242,18956,3.65,1789,0,0,0.26,1048.93,1874,182.11,595.78,2208.83,10.85,2215,1.61,6.27,12.96]
["ES",2015,"C18",1,1,null,null,null,2270842,2004454,764634,2240,17283,3.88,1787,0,0,0.26,895.09,1872,182.09,595.77,2207.54,10.31,2213,1.61,6.27,12.96]
["ES",2015,"C18",2,1,null,null,null,null,null,null,2,null,null,2,null,null,null,null,2,null,null,null,null,2]
["ES",2015,"C18","1a",1,null,null,null,1662307,1478310,567298,2209,14207,3.01,1758,0,0,0.23,783.09,1842,177.28,586,2182.69,9.7100000000000009,2182,1.58,6.22,12.82]
["ES",2015,"C18","1b",1,null,null,null,608535,526143,197335,31,3076,5.84,29,null,null,null,1327.44,30,null,null,null,11.98,31]
["ES",2015,"C19",0,1,50,null,88.66,19855091,32156174,2498224,8,7848,18.899999999999999,7,null,null,null,1783.49,8,null,null,null,7.11,8]
["ES",2015,"C19",1,1,null,null,null,null,null,null,4,null,null,3,null,null,null,null,4,null,null,null,null,4]
["ES",2015,"C19",2,1,null,null,null,null,null,null,4,null,null,4,null,null,null,null,4,null,null,null,null,4]
["ES",2015,"C19","1a",1,null,null,null,null,null,null,3,null,null,2,null,null,null,null,3,null,null,null,null,3]
["ES",2015,"C19","1b",1,null,null,null,null,null,null,1,null,null,1,null,null,null,null,1,null,null,null,null,1]
["ES",2015,"C20",0,1,32.130000000000003,null,42.57,16518674,20974396,3796561,1004,35220,8.36,841,0,7.0000000000000007E-2,1.07,1972.08,869,205.64,741.57,4155.83,10.06,993,2.38,6.2,11.96]
["ES",2015,"C20",1,1,null,null,null,3006345,3157835,860156,947,14332,2.86,787,0,0.05,0.97,1295.05,815,189.8,671.49,3635.62,10.15,936,2.11,5.84,11.75]
["ES",2015,"C20",2,1,null,null,null,13512328,17816561,2936405,57,20888,9.35,54,0.1,0.9,6.29,2175.84,54,934.12,3993.06,13873.88,10.039999999999999,57,6.05,10.74,17.41]
["ES",2015,"C20","1a",1,null,null,null,1221322,1166187,353394,857,7536,2.5299999999999998,699,0,0.03,0.79,909.84,733,168.84,541.37,2813.6,8.82,846,1.87,5.48,11.39]
["ES",2015,"C20","1b",1,null,null,null,1785023,1991647,506762,90,6796,3.02,88,0.05,0.4,2.82,1618.71,82,564.61,2946.89,15069.5,10.93,90,4.8600000000000003,9.35,15.7]
["ES",2015,"C21",0,1,30.73,null,59.22,10715783,7620736,2553919,110,23191,7.26,96,0,0.15,3.08,2074.79,76,420.85,2240.06,8475.1200000000008,16.02,101,8.5500000000000007,14.5,26.73]
["ES",2015,"C21",1,1,null,null,null,715798,538932,242622,77,3408,3.59,64,0,0.02,0.78,2687.66,47,204.6,876.44,5925.96,18.02,68,4.84,14.87,27.96]
["ES",2015,"C21",2,1,null,null,null,9999984,7081803,2311297,33,19783,7.58,32,0.35,2.2999999999999998,7.22,2034.68,29,1505.62,4035.03,10229.25,15.87,33,10.75,13.82,23.8]
["ES",2015,"C21","1a",1,null,null,null,151357,107515,47293,61,883,1.34,48,0,0.01,0.78,1215.67,37,87.7,427.77,4595.21,16.12,52,2.27,13.28,32.6]
["ES",2015,"C21","1b",1,null,null,null,564441,431417,195328,16,2525,4.08,16,0.01,0.06,1.32,3647.11,10,null,3043.83,null,18.5,16,10.99,18.14,24.32]
["ES",2015,"C22",0,1,29.11,null,38.99,7048994,9231557,2502207,1125,34235,5.81,999,0,0.03,0.73,2308.5500000000002,981,349.58,945.18,3433.46,12.48,1111,3.3,7.28,12.95]
["ES",2015,"C22",1,1,null,null,null,2980422,3392091,990041,1099,19024,3.8,973,0,0.02,0.63,1355.36,955,338.77,910.13,3208.36,10.49,1085,3.23,7.22,12.94]
["ES",2015,"C22",2,1,null,null,null,4068571,5839466,1512165,26,15211,6.71,26,0.27,0.94,2.56,3366.43,26,1843.11,4523.1899999999996,7752.95,13.64,26,6.9,9.7799999999999994,14.49]
["ES",2015,"C22","1a",1,null,null,null,1460228,1549324,504731,1020,11521,2.3199999999999998,895,0,0.02,0.54,1082.49,879,304.55,866.67,3017.06,9.82,1006,3.02,6.99,12.74]
["ES",2015,"C22","1b",1,null,null,null,1520194,1842766,485309,79,7503,4.9000000000000004,78,0.08,0.48,2.91,1669.66,76,745.72,1530.14,6672.65,11.06,79,5.6,9.06,16.809999999999999]
["ES",2015,"C23",0,1,24.14,null,30.75,13356290,5261746,1473777,1511,25245,36.090000000000003,1071,0,0.02,0.84,450.52,1327,-139.94999999999999,344.21,1545.89,12.41,1497,-2.36,4.33,9.85]
["ES",2015,"C23",1,1,null,null,null,3675576,2409781,656242,1490,15921,15.22,1050,0,0.01,0.78,469.8,1306,-147.57,330.06,1528.92,6.18,1476,-2.5,4.24,9.67]
["ES",2015,"C23",2,1,null,null,null,9680714,2851965,817534,21,9324,42.25,21,2.4500000000000002,4.46,33.99,445.13,21,556.54,871.99,2898.02,17.68,21,11.88,15.87,21]
["ES",2015,"C23","1a",1,null,null,null,2312104,1257757,383630,1435,10925,10.83,1004,0,0.01,0.68,465.33,1255,-174.06,314.08,1507.91,5.62,1421,-2.87,4.08,9.57]
["ES",2015,"C23","1b",1,null,null,null,1363471,1152024,272612,55,4995,19.190000000000001,46,0.12,0.68,4.0199999999999996,473.92,51,212.78,706.57,1956.2,6.79,55,3.21,7.5,10.72]
["ES",2015,"C24",0,1,61.77,null,59.92,17181389,17702269,2733378,664,34610,7,558,0,0.03,1,617.16,584,185.52,565.5,3128.22,6.26,660,1.99,5.43,10.33]
["ES",2015,"C24",1,1,null,null,null,1620407,1682942,458171,624,9264,4.66,524,0,0.02,0.78,694.64,545,185.87,568.46,2996.09,7.17,620,1.96,5.45,10.37]
["ES",2015,"C24",2,1,null,null,null,15560981,16019327,2275206,40,25346,7.29,34,0.02,1.18,6.03,608.86,39,198.01,495.38,5071.4399999999996,6.16,40,2.67,5.17,9.4600000000000009]
["ES",2015,"C24","1a",1,null,null,null,729391,692915,234532,577,5395,3.72,479,0,0.01,0.66,648.36,499,175.86,536.82000000000005,2877.43,7.54,573,1.84,5.44,10.38]
["ES",2015,"C24","1b",1,null,null,null,891016,990027,223638,47,3869,5.37,45,0.01,0.3,3.24,734.63,46,306.42,1014.56,4944.16,6.92,47,3.17,5.95,10.26]
["ES",2015,"C25",0,1,26.88,null,34.89,9637245,9680940,3204746,5429,65505,6.14,4370,0,0,0.45,951.54,4635,178.53,648.38,2762.43,9.3000000000000007,5366,1.66,5.5,11.15]
["ES",2015,"C25",1,1,null,null,null,7125730,7089788,2556030,5405,56208,3.16,4346,0,0,0.44,891.33,4611,177.33,645.28,2746.01,8.7899999999999991,5342,1.62,5.48,11.14]
["ES",2015,"C25",2,1,null,null,null,2511514,2591152,648715,24,9297,12.83,24,0.2,1.2,5.36,1121.82,24,720.16,2256.86,5039.38,10.7,24,6.43,9.9600000000000009,14.13]
["ES",2015,"C25","1a",1,null,null,null,4733750,4578218,1842861,5288,44519,3.1,4231,0,0,0.38,806.54,4499,173.81,631.07000000000005,2729.67,8.19,5225,1.54,5.37,11.09]
["ES",2015,"C25","1b",1,null,null,null,2391979,2511569,713168,117,11688,3.26,115,0.05,0.95,3.35,1059.76,112,565.76,1337.15,4408.8500000000004,9.8699999999999992,117,4.75,8.7899999999999991,12.75]
["ES",2015,"C26",0,1,22.78,null,29.97,1228378,1273753,384300,418,7007,6.84,323,0,0,0.56999999999999995,771.24,335,136.53,760.78,3228.47,7.06,407,1.26,5.52,12.8]
["ES",2015,"C26",1,1,null,null,null,948912,873906,291830,413,5608,8.8800000000000008,319,0,0,0.52,597.87,331,136.53,760.78,3176.88,7.43,402,1.26,5.53,12.82]
["ES",2015,"C26",2,1,null,null,null,null,null,null,5,null,null,4,null,null,null,null,4,null,null,null,null,5]
["ES",2015,"C26","1a",1,null,null,null,476975,410718,165216,392,3449,3.83,301,0,0,0.34,860.13,311,127.09,691.54,3166.66,9.19,381,1.19,5.4,13]
["ES",2015,"C26","1b",1,null,null,null,471936,463187,126614,21,2159,null,18,null,null,null,null,20,null,null,null,null,21]
["ES",2015,"C27",0,1,29.27,null,47.67,8707930,9100948,2048463,507,28759,17.239999999999998,382,0,0.02,1.61,887.9,419,75.92,537.25,2805.13,8.27,496,0.28999999999999998,4.49,10.6]
["ES",2015,"C27",1,1,null,null,null,1479897,1208413,377919,483,8075,25.16,359,0,0.01,1.18,473.64,395,57.24,508.07,2465.15,7.77,472,0.12,4.25,10.49]
["ES",2015,"C27",2,1,null,null,null,7228033,7892535,1670543,24,20684,16.11,23,0.49,1.39,11.52,1014.49,24,450.16,1242.5999999999999,5078.5,8.34,24,4.66,7.19,13.22]
["ES",2015,"C27","1a",1,null,null,null,519820,510679,177073,450,4262,5.32,329,0,0,0.7,508.3,366,34.01,475.09,2206.38,4.93,439,-0.54,3.94,10.14]
["ES",2015,"C27","1b",1,null,null,null,960077,697733,200845,33,3813,32.44,30,null,null,null,462.08,29,null,null,null,9.85,33]
["ES",2015,"C28",0,1,39.43,null,46.57,7353673,7495833,2707603,1924,43077,10.99,1647,0,0.03,0.78,1903.96,1665,239.43,878.14,4169.38,12.66,1906,2.7,6.44,12.12]
["ES",2015,"C28",1,1,null,null,null,4725318,4241274,1518668,1900,28317,4.92,1624,0,0.02,0.75,1061.1500000000001,1643,234.65,856.43,4085.06,9.89,1882,2.66,6.42,12.12]
["ES",2015,"C28",2,1,null,null,null,2628354,3254558,1188935,24,14759,15.79,23,0.57999999999999996,1,2.4900000000000002,5134.7299999999996,22,1074.72,3745.51,47196.22,16.260000000000002,24,5.9,8.6199999999999992,12.02]
["ES",2015,"C28","1a",1,null,null,null,2565811,2364581,910394,1817,19018,3.15,1545,0,0.02,0.63,941.71,1567,225.21,818.36,3902.3,9.08,1799,2.5499999999999998,6.27,11.84]
["ES",2015,"C28","1b",1,null,null,null,2159506,1876693,608273,83,9299,6.78,79,0.17,1.1599999999999999,4.96,1224.22,76,621.05999999999995,1916.81,5555.55,10.9,83,5.68,10.63,15.23]
["ES",2015,"C29",0,1,31.29,null,66.16,25123900,53112407,7536799,460,95577,5.39,396,0,0.03,0.78,2825.86,386,268.88,829.92,3822.28,6.27,452,2.46,5.73,11.43]
["ES",2015,"C29",1,1,null,null,null,1346659,1497334,472908,412,9925,6.21,351,0,0.02,0.6,1226.6199999999999,340,249.41,730.56,2565.64,7.66,404,2.21,5.49,11.47]
["ES",2015,"C29",2,1,null,null,null,23777240,51615073,7063891,48,85652,5.36,45,0,0.44,2.61,2963.65,46,916.85,3946.53,14893.21,6.23,48,5.25,7.52,11]
["ES",2015,"C29","1a",1,null,null,null,478718,501299,177043,369,4647,11.03,310,0,0.01,0.37,739.4,304,223.25,637.89,2104.2800000000002,7.24,362,2.15,5.12,11.12]
["ES",2015,"C29","1b",1,null,null,null,867941,996034,295864,43,5277,3.98,41,0.09,1.51,3.66,1765.03,36,942.35,2180.1,7443.1,7.87,42,4.7699999999999996,8.6999999999999993,12.85]
["ES",2015,"C30",0,1,26.37,null,50.78,17005902,5954884,1760166,159,24521,32.89,127,0,0.04,0.88,273.32,137,126.32,590.89,2786.07,9.48,156,1.54,5.93,12.45]
["ES",2015,"C30",1,1,null,null,null,457354,405325,164679,144,3302,3.82,114,0,0.02,0.45,1085.48,122,122.53,579.67999999999995,2440.9899999999998,9.9600000000000009,141,1.43,5.2,11.91]
["ES",2015,"C30",2,1,null,null,null,16548548,5549559,1595487,15,21219,35.130000000000003,13,0.23,4.41,15.93,258.43,15,449.27,926.31,5316.03,9.44,15,7.44,10.51,15.41]
["ES",2015,"C30","1a",1,null,null,null,194889,134154,64934,132,1524,6.12,102,0,0.01,0.39,717.57,110,87.94,475,2218.46,9.23,129,0.83,4.78,11.91]
["ES",2015,"C30","1b",1,null,null,null,262465,271170,99744,12,1778,2.8,12,null,null,null,1404.38,12,null,null,null,10.31,12]
["ES",2015,"C31",0,1,26.52,null,31.65,1551881,1362606,434697,1622,13750,9.52,1080,0,0,0.27,510.23,1346,-241.53,289.68,1115.49,5.18,1598,-4.33,3.04,7.23]
["ES",2015,"C31",1,1,null,null,null,1407391,1291189,414015,1621,13398,3.59,1079,0,0,0.27,491.85,1345,-242.3,289.64999999999998,1117.4000000000001,4.9000000000000004,1597,-4.33,3.04,7.21]
["ES",2015,"C31",2,1,null,null,null,null,null,null,1,null,null,1,null,null,null,null,1,null,null,null,null,1]
["ES",2015,"C31","1a",1,null,null,null,1138917,991294,322833,1608,11441,6.11,1066,0,0,0.26,300.63,1333,-243.2,288.13,1096.6300000000001,3.47,1584,-4.4000000000000004,2.97,7.14]
["ES",2015,"C31","1b",1,null,null,null,268474,299895,91181,13,1957,0.57999999999999996,13,null,null,null,2030.67,12,null,null,null,9.6199999999999992,13]
["ES",2015,"C32",0,1,26.26,null,29.96,1276750,1234437,398250,960,8489,6.61,751,0,0,0.34,1524.63,736,165.43,728.71,2792.15,10.07,948,1.41,5.93,13.17]
["ES",2015,"C32",1,1,null,null,null,942158,916578,307499,958,7321,3.08,749,0,0,0.33,973.26,734,164.98,720.6,2700.34,8.6300000000000008,946,1.41,5.92,13.15]
["ES",2015,"C32",2,1,null,null,null,null,null,null,2,null,null,2,null,null,null,null,2,null,null,null,null,2]
["ES",2015,"C32","1a",1,null,null,null,674012,599498,223218,944,6015,4.8,735,0,0,0.3,813.79,721,162.66999999999999,708.74,2656.01,8.17,932,1.35,5.89,13.12]
["ES",2015,"C32","1b",1,null,null,null,268145,317079,84280,14,1306,0.3,14,null,null,null,1427.96,13,null,null,null,9.5,14]
["ES",2015,"C33",0,1,44.4,null,34.630000000000003,3022816,2429974,988600,2341,20944,2.23,1826,0,0,0.22,1636.92,1873,140.44,713.72,3435.2,9.76,2320,0.83,4.82,10.77]
["ES",2015,"C33",1,1,null,null,null,1642102,1910102,825218,2336,19328,2.66,1821,0,0,0.22,1207.99,1870,140.28,711.4,3401.11,8.32,2315,0.81,4.8099999999999996,10.73]
["ES",2015,"C33",2,1,null,null,null,null,null,null,5,null,null,5,null,null,null,null,3,null,null,null,null,5]
["ES",2015,"C33","1a",1,null,null,null,1273410,1442281,643146,2312,16209,3.16,1800,0,0,0.22,960.53,1851,138.61000000000001,706.94,3385.98,7.72,2291,0.8,4.7699999999999996,10.69]
["ES",2015,"C33","1b",1,null,null,null,368691,467820,182072,24,3118,1.48,21,0,0.08,0.64,3042.53,19,636.83000000000004,2003.64,5626.82,10.17,24,5.78,9.23,14.67]
["ES",2015,"D",0,1,53.25,null,83.01,232511305,96463299,15296101,6930,30815,25.44,6385,0,0,7.0000000000000007E-2,613.16999999999996,5470,235.86,644.35,1596.7,17.32,6897,25.36,73.55,80.92]
["ES",2015,"D",1,1,null,null,null,11664425,2158785,1249576,6874,2456,2.9,6333,0,0,7.0000000000000007E-2,342.79,5415,235.79,643.12,1594,55.28,6841,26.44,73.62,80.930000000000007]
["ES",2015,"D",2,1,null,null,null,220846880,94304514,14046525,56,28359,27.17,52,-0.28000000000000003,7.0000000000000007E-2,3.76,652.78,55,284.77,799.21,2841.29,16.45,56,4.4000000000000004,23.85,69.33]
["ES",2015,"D","1a",1,null,null,null,7103739,1340577,773924,6831,2103,3.26,6290,0,0,0.06,340.85,5374,236.23,646.42999999999995,1594.96,54.51,6799,26.13,73.67,80.95]
["ES",2015,"D","1b",1,null,null,null,4560685,818208,475652,43,353,2.3199999999999998,43,0.02,0.26,1.91,345.91,41,223.21,272.74,771.09,56.54,42,54.2,70.319999999999993,75.42]
["ES",2015,"D35",0,1,53.25,null,83.01,232511305,96463299,15296101,6930,30815,25.44,6385,0,0,7.0000000000000007E-2,613.16999999999996,5470,235.86,644.35,1596.7,17.32,6897,25.36,73.55,80.92]
["ES",2015,"D35",1,1,null,null,null,11664425,2158785,1249576,6874,2456,2.9,6333,0,0,7.0000000000000007E-2,342.79,5415,235.79,643.12,1594,55.28,6841,26.44,73.62,80.930000000000007]
["ES",2015,"D35",2,1,null,null,null,220846880,94304514,14046525,56,28359,27.17,52,-0.28000000000000003,7.0000000000000007E-2,3.76,652.78,55,284.77,799.21,2841.29,16.45,56,4.4000000000000004,23.85,69.33]
["ES",2015,"D35","1a",1,null,null,null,7103739,1340577,773924,6831,2103,3.26,6290,0,0,0.06,340.85,5374,236.23,646.42999999999995,1594.96,54.51,6799,26.13,73.67,80.95]
["ES",2015,"D35","1b",1,null,null,null,4560685,818208,475652,43,353,2.3199999999999998,43,0.02,0.26,1.91,345.91,41,223.21,272.74,771.09,56.54,42,54.2,70.319999999999993,75.42]
["ES",2015,"E",0,1,27.01,null,67.5,33947149,9326297,5122192,865,78978,19.18,719,0,0.06,1.34,643.97,719,248.71,915.43,3698.8,29.91,853,3.1,9.8000000000000007,19.989999999999998]
["ES",2015,"E",1,1,null,null,null,4019510,2103780,916303,833,16556,2.9,689,0,0.04,1,839.22,689,234.64,914.2,3699.46,16.329999999999998,821,2.82,9.17,19.39]
["ES",2015,"E",2,1,null,null,null,29927639,7222517,4205889,32,62422,21.46,30,0.56999999999999995,6.13,26.82,623.6,30,469.25,1213.24,3239.38,33.869999999999997,32,13.98,23.36,35.67]
["ES",2015,"E","1a",1,null,null,null,1246176,760319,310708,774,7171,3.8,630,0,0.03,0.88,812.91,638,224.89,874.62,3654.58,12.95,762,2.4900000000000002,8.74,18.57]
["ES",2015,"E","1b",1,null,null,null,2773334,1343461,605595,59,9385,2.54,59,0.03,0.47,3.77,850.29,51,603.27,1215.8599999999999,4052.8,18.23,59,8.1,15.94,24.43]
["ES",2015,"E36",0,1,31.24,null,76.5,17771315,4614698,2254752,274,24765,10.119999999999999,239,0,0.23,2.81,1082.3499999999999,207,439.68,1450.98,5901.95,28.18,272,5.46,13.82,24.79]
["ES",2015,"E36",1,1,null,null,null,2138473,922908,430835,254,6198,1.88,219,0,0.16,2.25,786.86,189,397.64,1450.98,5767.1,19.95,252,4.8099999999999996,13.51,24.28]
["ES",2015,"E36",2,1,null,null,null,15632842,3691790,1823917,20,18567,11.48,20,0.42,3.19,21.77,1153.78,18,808.95,1362,6925.61,30.24,20,17.440000000000001,23.66,35.67]
["ES",2015,"E36","1a",1,null,null,null,541706,219856,96743,222,1738,2.04,187,0,0.09,2.14,1035.55,161,241.31,1450.98,8231.33,17.82,220,3.85,11.7,24.04]
["ES",2015,"E36","1b",1,null,null,null,1596766,703052,334091,32,4460,1.84,32,0,0.27,3.28,738.9,28,810.28,1479.18,3537.15,20.61,32,14.25,17.850000000000001,25.27]
["ES",2015,"E37",0,1,23.05,null,29.3,582059,177009,74252,62,989,7.21,50,0,0.03,0.81,1206.83,55,228.47,623.38,1982.61,16.97,61,3.36,9.8000000000000007,14.94]
["ES",2015,"E37",1,1,null,null,null,383050,126976,59885,61,819,5.77,50,0,0.03,0.81,1589.22,54,236.26,653.26,2012.85,24.71,60,3.63,9.82,15.35]
["ES",2015,"E37",2,1,null,null,null,null,null,null,1,null,null,0,null,null,null,null,1,null,null,null,null,1]
["ES",2015,"E37","1a",1,null,null,null,86584,50400,22871,57,504,10.19,46,0,0.02,0.38,393.58,52,230.33,653.26,1952.36,14.28,56,3.63,9.74,14.84]
["ES",2015,"E37","1b",1,null,null,null,null,null,null,4,null,null,4,null,null,null,null,2,null,null,null,null,4]
["ES",2015,"E38",0,1,22.8,null,65.27,15406544,4422795,2748387,438,52149,27.64,353,0,0.04,0.87,468.76,379,221.89,759.38,3050.49,32.75,430,2.09,8.31,17.57]
["ES",2015,"E38",1,1,null,null,null,1310756,942101,380782,427,8464,3.35,343,0,0.03,0.64,837.83,368,223.59,763.66,3046.36,12.47,419,1.94,8.25,17.059999999999999]
["ES",2015,"E38",2,1,null,null,null,14095788,3480694,2367605,11,43685,29.79,10,null,18.84,null,451.22,11,null,464.06,null,38.24,11,null,23.46]
["ES",2015,"E38","1a",1,null,null,null,536369,423772,162300,406,4219,4.04,322,0,0.03,0.55000000000000004,726.06,348,202.39,724.83,2903.68,10.28,398,1.71,8.26,16.53]
["ES",2015,"E38","1b",1,null,null,null,774386,518328,218482,21,4245,2.95,21,null,null,null,921.46,20,null,null,null,14.26,21]
["ES",2015,"E39",0,1,66.91,null,79.19,187230,111794,44799,91,1073,7.02,77,0,0,0.31,685.11,78,244.91,970.25,3435.1,9.41,90,2.33,6.24,17.309999999999999]
["ES",2015,"E39",1,1,null,null,null,187230,111794,44799,91,1073,7.02,77,0,0,0.31,685.11,78,244.91,970.25,3435.1,9.41,90,2.33,6.24,17.309999999999999]
["ES",2015,"E39",2,1,null,null,null,null,null,null,0,null,null,0,null,null,null,null,0,null,null,null,null,0]
["ES",2015,"E39","1a",1,null,null,null,81514,66289,28792,89,708,5.23,75,0,0,0.25,1699.5,77,299.01,1018.18,3440.17,12.9,88,2.2599999999999998,6.24,17.440000000000001]
["ES",2015,"E39","1b",1,null,null,null,null,null,null,2,null,null,2,null,null,null,null,1,null,null,null,null,2]
["ES",2015,"F",0,1,15.89,null,35.770000000000003,80883379,30972024,9766630,33132,220197,31.07,22712,0,0,0.28999999999999998,283.97000000000003,25059,-123.82,361.55,2035.26,8.42,31150,-2.65,3.95,12.25]
["ES",2015,"F",1,1,null,null,null,39443452,15623207,5668163,33063,158495,20.76,22654,0,0,0.28000000000000003,326.29000000000002,24990,-125.86,361.55,2042.31,6.63,31082,-2.68,3.95,12.24]
["ES",2015,"F",2,1,null,null,null,41439926,15348816,4098467,69,61701,37.86,58,7.06,27.29,46.85,261.62,69,133.22,366.35,746.4,10.24,68,3.34,7.33,12.91]
["ES",2015,"F","1a",1,null,null,null,33059871,12415208,4685056,32882,140018,13.92,22496,0,0,0.26,285.89999999999998,24815,-131.58000000000001,359.08,2031.96,5.84,30902,-2.77,3.93,12.24]
["ES",2015,"F","1b",1,null,null,null,6383581,3207999,983106,181,18476,36.770000000000003,158,0.43,3.93,16.8,487.22,175,233.47,740.99,3232.77,9.67,180,2.4300000000000002,5.42,12.13]
["ES",2015,"F41",0,1,10.73,null,22.73,43847421,8865881,2023958,15226,54876,44.78,9711,0,0,0.5,130.94999999999999,11101,-270,234.14,1539.5,5.66,13539,-7.26,4.2,23.23]
["ES",2015,"F41",1,1,null,null,null,27159724,5095133,1572673,15204,46764,36.17,9696,0,0,0.49,176.89,11079,-270.22000000000003,233.53,1540.51,7.36,13518,-7.27,4.2,23.24]
["ES",2015,"F41",2,1,null,null,null,16687697,3770748,451284,22,8111,70.31,15,3.53,16.559999999999999,60.56,74,22,-18.489999999999998,289.3,593.16999999999996,3.36,21,-1.1200000000000001,5.97,8.52]
["ES",2015,"F41","1a",1,null,null,null,24018221,4170151,1414420,15150,44026,26.4,9655,0,0,0.47,162.79,11025,-274.57,232.98,1541.79,6.73,13465,-7.36,4.2,23.35]
["ES",2015,"F41","1b",1,null,null,null,3141502,924981,158253,54,2738,65.13,41,1.08,5.98,28.87,237.97,54,25.77,343.97,1068.3800000000001,10.23,53,0.21,4.29,14.47]
["ES",2015,"F42",0,1,51.84,null,69.069999999999993,21701432,10198023,3000444,959,44186,27.56,695,0,0.03,2.66,305.01,784,53.46,451.7,2518.84,10.09,932,-0.35,4.33,12.28]
["ES",2015,"F42",1,1,null,null,null,2950099,1618169,532413,929,11401,25.55,668,0,0.02,1.97,696.29,754,32.200000000000003,451.7,2543.88,9.67,902,-0.49,4.24,11.96]
["ES",2015,"F42",2,1,null,null,null,18751332,8579853,2468030,30,32784,27.92,27,10.95,27.47,46.24,277.11,30,168.63,456.29,911.1,10.17,30,3.82,8.65,12.5]
["ES",2015,"F42","1a",1,null,null,null,1167529,796531,289425,885,7489,7.49,626,0,0.01,1.29,501.11,712,-15.4,439.54,2523.96,6.32,858,-1.1299999999999999,4.05,11.74]
["ES",2015,"F42","1b",1,null,null,null,1782570,821637,242988,44,3911,34.14,42,2.17,11.23,21.6,854.36,42,324.58999999999997,758.6,4333.9799999999996,12.91,44,4.33,7.95,16.62]
["ES",2015,"F43",0,1,26.21,null,39.06,15334528,11908119,4742228,16947,121134,28.03,12306,0,0,0.18,545,13174,4.13,476.89,2430.39,9.0299999999999994,16679,-0.75,3.8,9.2899999999999991]
["ES",2015,"F43",1,1,null,null,null,9333631,8909905,3563076,16930,100328,7.8,12290,0,0,0.17,608.80999999999995,13157,3.08,476.81,2434.4499999999998,5.65,16662,-0.76,3.8,9.27]
["ES",2015,"F43",2,1,null,null,null,6000897,2998214,1179152,17,20806,45.84,16,6.24,24.62,55.51,498.96,17,227.11,488.31,695.79,19.079999999999998,17,4.26,9.35,16.579999999999998]
["ES",2015,"F43","1a",1,null,null,null,7874124,7448525,2981211,16847,88502,5.86,12215,0,0,0.16,553.27,13078,0.17,474.93,2422,5.29,16579,-0.81,3.79,9.27]
["ES",2015,"F43","1b",1,null,null,null,1459507,1461379,581864,83,11826,14.8,75,0.2,1.87,7.42,953.73,79,307.54000000000002,1135.18,3539.02,7.49,83,2.4,4.8499999999999996,9.94]
["ES",2015,"G",0,1,21.8,null,45.03,168426787,255723352,37065343,64414,853696,23.29,47319,0,0,0.6,1128.8499999999999,49100,46.38,451.71,2164.48,5.86,63341,-0.24,2.73,6.89]
["ES",2015,"G",1,1,null,null,null,58033166,82235708,14187165,64076,381091,5.9,46997,0,0,0.57999999999999996,719.75,48786,40.770000000000003,445.98,2132.84,4.3600000000000003,63005,-0.28000000000000003,2.72,6.89]
["ES",2015,"G",2,1,null,null,null,110393622,173487643,22878177,338,472605,28.76,322,0.19,1.55,14.41,1374.51,314,591.17999999999995,1958.33,6753.14,6.58,336,1.98,4,7.21]
["ES",2015,"G","1a",1,null,null,null,41905700,53579472,10039326,62659,297648,5.73,45652,0,0,0.5,593.65,47512,22.39,431.41,2077.36,4.04,61588,-0.44,2.69,6.9]
["ES",2015,"G","1b",1,null,null,null,16127466,28656236,4147839,1417,83443,6.17,1345,0.06,0.85,3.85,1063.44,1274,401.79,1137.6400000000001,4941.3100000000004,4.96,1417,1.81,3.66,6.42]
["ES",2015,"G45",0,1,25.7,null,37.01,12061415,21949535,2885764,9063,66649,4.3899999999999997,6289,0,0,0.47,864.57,7037,-126.77,354.38,1547.11,3.57,8974,-2,2.29,5.68]
["ES",2015,"G45",1,1,null,null,null,7235761,11089413,2040201,9021,55312,4.4400000000000004,6249,0,0,0.46,513.5,6996,-133.19,351.34,1525.81,3.58,8932,-2.0499999999999998,2.2799999999999998,5.69]
["ES",2015,"G45",2,1,null,null,null,4825653,10860121,845541,42,11336,4.34,40,0.02,0.5,3.18,2926.08,41,683.61,1792.32,4389.51,3.55,42,1.93,3.08,4.3099999999999996]
["ES",2015,"G45","1a",1,null,null,null,4782295,6094782,1369168,8787,42055,5.27,6030,0,0,0.38,436.95,6774,-171.26,336.33,1511.9,3.27,8698,-2.29,2.27,5.73]
["ES",2015,"G45","1b",1,null,null,null,2453465,4994631,671033,234,13256,3.61,219,0.04,0.7,3.97,623.66,222,310.60000000000002,674.41,1744.17,3.96,234,1.45,2.48,4.45]
["ES",2015,"G46",0,1,21.25,null,35.479999999999997,89167346,134667229,15548858,30559,287409,30.7,23974,0,0.02,0.91,1134.51,23524,146.38999999999999,569.58000000000004,2872.87,5.67,29954,0.69,3.28,8.08]
["ES",2015,"G46",1,1,null,null,null,37571996,52521782,8562190,30352,202012,6.45,23776,0,0.01,0.88,800.85,23332,144.91,565.51,2850.74,4.74,29748,0.68,3.27,8.09]
["ES",2015,"G46",2,1,null,null,null,51595349,82145447,6986668,207,85397,42.43,198,0.45,2.75,16.02,1420.96,192,524.54,1762.91,5519.68,6.27,206,1.92,4.0999999999999996,7.2]
["ES",2015,"G46","1a",1,null,null,null,25804177,32501875,5707658,29363,148355,5.97,22833,0,0.01,0.78,663.31,22447,136.27000000000001,546.04,2767.81,4.5,28759,0.61,3.25,8.17]
["ES",2015,"G46","1b",1,null,null,null,11767819,20019906,2854531,989,53656,7.14,943,0.06,0.77,3.89,1135.29,885,409.45,1212.1500000000001,5471.73,5.14,989,1.89,3.86,6.96]
["ES",2015,"G47",0,1,21.29,null,55.15,67198041,99106588,18630716,24792,499638,16.940000000000001,17056,0,0,0.3,1164.48,18539,-148.71,370.87,1686.57,6.63,24413,-1.99,2.21,6.05]
["ES",2015,"G47",1,1,null,null,null,13225422,18624513,3584748,24703,123767,4.79,16972,0,0,0.28999999999999998,635.39,18458,-153.72,368.02,1661.37,3.75,24325,-2.02,2.2000000000000002,6.04]
["ES",2015,"G47",2,1,null,null,null,53972619,80482074,15045967,89,375870,18.38,84,0.14000000000000001,1.47,14.19,1292.49,81,630.97,3956.83,25799.23,7.3,88,2.62,4.46,7.53]
["ES",2015,"G47","1a",1,null,null,null,11319240,14982814,2962499,24509,107236,5.21,16789,0,0,0.26,510.41,18291,-161.29,360.98,1638.36,3.36,24131,-2.13,2.1800000000000002,6.03]
["ES",2015,"G47","1b",1,null,null,null,1906181,3641698,622248,194,16530,3.72,183,0.12,1.33,3.41,1715.56,167,555.24,1975.39,12666.67,5.37,194,2.2999999999999998,4.1500000000000004,6.48]
["ES",2015,"H",0,1,21.07,null,51.94,157434266,43762411,19772428,10397,275878,7.15,8550,0,0,0.55000000000000004,567.44000000000005,8513,236.72,871.88,2970.26,21.35,10220,2,7.91,16.98]
["ES",2015,"H",1,1,null,null,null,19392142,14249039,5117619,10291,106650,3.09,8450,0,0,0.51,786.92,8418,235.17,868.14,2957.4,11.62,10114,1.98,7.88,16.920000000000002]
["ES",2015,"H",2,1,null,null,null,138042123,29513371,14654808,106,169228,8.02,100,0.1,2.92,9.85,535.29999999999995,95,309.02,1376.89,5357.02,26.05,106,3.17,9.91,58.57]
["ES",2015,"H","1a",1,null,null,null,9164953,9233897,3230601,10036,77239,3.82,8211,0,0,0.45,925.04,8207,226.46,858,2904.59,9.9499999999999993,9860,1.91,7.91,16.89]
["ES",2015,"H","1b",1,null,null,null,10227189,5015142,1887018,255,29411,2.17,239,0,0.86,3.86,663.39,211,576.20000000000005,1610.66,7080.63,14.69,254,3.32,7.5,18.64]
["ES",2015,"H49",0,1,22.96,null,47.68,40905881,19114689,8092581,7443,130771,7,6203,0,0,0.45,634.57000000000005,6239,272.86,874.35,2639.7,16.350000000000001,7334,2.61,8.9499999999999993,17.16]
["ES",2015,"H49",1,1,null,null,null,8216863,8760529,3228715,7402,73429,2.75,6164,0,0,0.43,980.14,6202,272.25,873.31,2638.37,10.130000000000001,7293,2.6,8.98,17.170000000000002]
["ES",2015,"H49",2,1,null,null,null,32689018,10354160,4863866,41,57341,8.68,39,0.31,3.31,9.39,556.66999999999996,37,367.37,1176.01,2917.84,21.6,41,2.9,5.14,10.82]
["ES",2015,"H49","1a",1,null,null,null,5496214,6203101,2285613,7275,55769,2.6,6046,0,0,0.37,1015.91,6094,268.77,865.91,2608.75,10.27,7166,2.58,9.0299999999999994,17.190000000000001]
["ES",2015,"H49","1b",1,null,null,null,2720648,2557427,943102,127,17659,3.13,118,0.11,1.19,4.6100000000000003,899.63,108,577.87,1338.8,4394.3900000000003,9.8000000000000007,127,3.18,6.69,14.99]
["ES",2015,"H50",0,1,54.64,null,45.21,732491,653134,167212,212,2561,8.81,151,0,0.01,0.39,1023.13,164,6.99,832.35,4565.2,11.7,204,-2.11,5.22,14.89]
["ES",2015,"H50",1,1,null,null,null,260853,259481,79639,210,1558,2.85,149,0,0.01,0.28000000000000003,2057.34,163,-2.69,832.46,4686.32,11.01,202,-2.31,5.03,14.93]
["ES",2015,"H50",2,1,null,null,null,null,null,null,2,null,null,2,null,null,null,null,1,null,null,null,null,2]
["ES",2015,"H50","1a",1,null,null,null,222682,182354,67131,206,1432,3.48,145,0,0.01,0.28000000000000003,1666.6,160,-26.82,811.81,4339.47,12.36,198,-2.6,4.87,14.93]
["ES",2015,"H50","1b",1,null,null,null,null,null,null,4,null,null,4,null,null,null,null,3,null,null,null,null,4]
["ES",2015,"H51",0,1,38.43,null,71.150000000000006,6346650,6636369,1815727,83,20756,14.6,63,0,0.01,4.2,3078.61,58,-18.37,650.41999999999996,6112.22,10.08,80,0.41,6.07,11.88]
["ES",2015,"H51",1,1,null,null,null,198006,184354,40230,78,567,9.61,58,0,0.01,3.15,751.95,53,-66.7,584.49,4285.4799999999996,6,75,-0.87,5.99,10.89]
["ES",2015,"H51",2,1,null,null,null,null,null,null,5,null,null,5,null,null,null,null,5,null,null,null,null,5]
["ES",2015,"H51","1a",1,null,null,null,69759,66700,10379,73,217,8.52,53,0,0,2.62,1158.5,49,-90.48,521,2367.38,5.16,70,-2.08,6,11.57]
["ES",2015,"H51","1b",1,null,null,null,null,null,null,5,null,null,5,null,null,null,null,4,null,null,null,null,5]
["ES",2015,"H52",0,1,17.77,null,39.78,106827951,15052640,8302767,2408,64937,6.06,1947,0,0.02,1.03,502.79,1849,179.14,899.44,4774.1000000000004,37.5,2353,1.24,5.47,17.489999999999998]
["ES",2015,"H52",1,1,null,null,null,10597680,4871705,1716472,2354,28835,3.41,1894,0,0.02,0.91,623.79,1801,175.67,884.81,4706.9399999999996,14.84,2299,1.18,5.36,16.690000000000001]
["ES",2015,"H52",2,1,null,null,null,96230271,10180935,6586294,54,36102,6.45,53,0,2.69,9.49,488.86,48,290.32,2081.41,11768.84,48.34,54,8.0399999999999991,50.9,70.680000000000007]
["ES",2015,"H52","1a",1,null,null,null,3262123,2622241,815644,2236,17598,6.92,1782,0,0.01,0.79,736.54,1705,166.67,859.11,4572,9.5299999999999994,2182,1.07,5.09,16.29]
["ES",2015,"H52","1b",1,null,null,null,7335556,2249463,900828,118,11236,1.56,112,0,0.66,3.07,577.12,96,563.73,2110.2199999999998,10875.51,21.03,117,3.5,8.59,35.83]
["ES",2015,"H53",0,1,9.11,null,96.63,2621291,2305578,1394139,251,56851,null,186,0,0,0.31,-6380.36,203,121.32,667.87,2689.44,-7.35,249,-0.25,4.1100000000000003,8.99]
["ES",2015,"H53",1,1,null,null,null,118739,172970,52561,247,2259,2.7,185,0,0,0.3,490.63,199,138.62,675.23,2689.44,2.93,245,0.09,4.3,9.23]
["ES",2015,"H53",2,1,null,null,null,null,null,null,4,null,null,1,null,null,null,null,4,null,null,null,null,4]
["ES",2015,"H53","1a",1,null,null,null,114172,159499,51832,246,2220,2.3199999999999998,185,0,0,0.3,561.82000000000005,199,138.62,675.23,2689.44,3.64,244,0.21,4.38,9.23]
["ES",2015,"H53","1b",1,null,null,null,null,null,null,1,null,null,0,null,null,null,null,0,null,null,null,null,1]
["ES",2015,"I",0,1,18.77,null,32.520000000000003,23838197,14074429,6467479,15628,211372,18.78,10928,0,0,0.1,542.24,11722,-87.01,495.15,2269.38,12.04,15286,-1.62,3.44,9.43]
["ES",2015,"I",1,1,null,null,null,12822455,9514796,4227442,15598,143764,5.34,10900,0,0,0.1,672.4,11695,-90.02,493.07,2260.1999999999998,9.85,15256,-1.64,3.43,9.4]
["ES",2015,"I",2,1,null,null,null,11015742,4559633,2240036,30,67607,35.380000000000003,28,0.36,5.27,32.9,437.6,27,531.41999999999996,1558.24,5110.4399999999996,16.63,30,5.63,11.1,17.47]
["ES",2015,"I","1a",1,null,null,null,9885077,8133299,3511308,15523,123931,2.95,10829,0,0,0.09,660.99,11625,-96.67,488.94,2250.61,8.4499999999999993,15181,-1.69,3.4,9.31]
["ES",2015,"I","1b",1,null,null,null,2937378,1381497,716133,75,19833,11.91,71,0.17,1.76,7.94,705.93,70,455.4,1136.29,4197.4399999999996,18.079999999999998,75,5.13,17.46,29.89]
["ES",2015,"I55",0,1,23.73,null,34.590000000000003,16720556,5503726,2785022,3296,66470,19.12,2604,0,0,0.35,481.6,2668,126,614.52,2522.35,19.16,3191,1.99,10.61,23.22]
["ES",2015,"I55",1,1,null,null,null,8592071,3467891,1753297,3282,42878,6.56,2592,0,0,0.34,700.99,2655,125.89,613.1,2513.9499999999998,18.600000000000001,3177,1.98,10.6,23.24]
["ES",2015,"I55",2,1,null,null,null,8128485,2035835,1031724,14,23591,38.94,12,2.57,9.26,39.200000000000003,322.45999999999998,13,170.28,908.53,4336.99,20.100000000000001,14,3.76,13.16,19.670000000000002]
["ES",2015,"I55","1a",1,null,null,null,5886394,2512741,1258337,3228,31970,3.08,2542,0,0,0.3,703.22,2603,122.99,601.66,2424.75,17,3123,1.93,10.43,22.7]
["ES",2015,"I55","1b",1,null,null,null,2705676,955149,494960,54,10907,13.38,50,0.23,1.96,10.33,696.64,52,402.74,1046.27,4135.17,22.81,54,10.7,23.92,33.81]
["ES",2015,"I56",0,1,17.78,null,31.65,7117641,8570703,3682456,12332,144901,18.21,8324,0,0,0.06,683.88,9054,-230.12,457.55,2178.14,7.48,12095,-2.44,2.63,7.13]
["ES",2015,"I56",1,1,null,null,null,4230384,6046905,2474144,12316,100885,2.64,8308,0,0,0.06,616.78,9040,-232,456.39,2169.04,4.82,12079,-2.4500000000000002,2.62,7.12]
["ES",2015,"I56",2,1,null,null,null,2887257,2523798,1208312,16,44016,31.22,16,0.17,1.4,15.15,752.24,14,773.8,2130.35,9731.2099999999991,13.84,16,5.66,9.65,14.36]
["ES",2015,"I56","1a",1,null,null,null,3998682,5620557,2252971,12295,91960,2.73,8287,0,0,0.06,601.58000000000004,9022,-235.44,454.25,2167.52,4.62,12058,-2.4700000000000002,2.61,7.11]
["ES",2015,"I56","1b",1,null,null,null,231702,426347,221173,21,8925,1.91,21,0.06,1.21,4.08,776.58,18,775.45,1729.34,4668.6499999999996,7.48,21,4.08,5.66,10.38]
["ES",2015,"J",0,1,24.04,null,51.11,65835930,46684892,19195867,8502,188577,7.71,6193,0,0,0.26,1823.37,5326,75.17,827.68,4933.5,14.99,8327,-0.32,6.32,18.010000000000002]
["ES",2015,"J",1,1,null,null,null,7301039,6474353,3272585,8436,71723,6.9,6131,0,0,0.24,1310.3399999999999,5264,68.66,814.85,4876.42,10.45,8261,-0.39,6.29,18.010000000000002]
["ES",2015,"J",2,1,null,null,null,58534890,40210538,15923282,66,116854,7.8,62,0.16,1.07,14.23,1903.06,62,880.78,3891.67,13135.6,15.73,66,4.6100000000000003,8.8699999999999992,21.38]
["ES",2015,"J","1a",1,null,null,null,4593524,3755913,1923784,8307,46011,6.33,6011,0,0,0.21,1104.8499999999999,5154,42.49,800.69,4700.72,9.7200000000000006,8132,-0.56000000000000005,6.25,18.100000000000001]
["ES",2015,"J","1b",1,null,null,null,2707515,2718439,1348800,129,25711,7.56,120,7.0000000000000007E-2,1.06,4.0599999999999996,1676.17,110,436.44,2230.91,11834.48,11.45,129,2.81,7.02,13.93]
["ES",2015,"J58",0,1,19.91,null,26.86,1719395,1402294,535057,1177,10025,34.44,806,0,0,0.38,1098.47,745,-327.35000000000002,485.27,3731.98,9.75,1168,-3.99,4.76,15.46]
["ES",2015,"J58",1,1,null,null,null,1348915,998516,419358,1172,8655,8.93,802,0,0,0.37,668.01,740,-330.37,477.4,3591.84,6.44,1163,-3.99,4.75,15.36]
["ES",2015,"J58",2,1,null,null,null,null,null,null,5,null,null,4,null,null,null,null,5,null,null,null,null,5]
["ES",2015,"J58","1a",1,null,null,null,882911,565260,236097,1150,5449,10.07,785,0,0,0.32,980.13,720,-343.77,473.6,3494.18,8.19,1141,-4.03,4.75,15.59]
["ES",2015,"J58","1b",1,null,null,null,466004,433255,183261,22,3206,5.98,17,0.13,1.49,12.02,366.81,20,6.2,1198.96,7218.62,4.1500000000000004,22,0.54,4.46,13.1]
["ES",2015,"J59",0,1,18.8,null,17.59,2324494,2036100,345151,966,6104,-9.32,693,0,0,0.14000000000000001,603.14,616,56.27,1004.75,6201.02,4.59,938,-0.57999999999999996,7.74,22.72]
["ES",2015,"J59",1,1,null,null,null,817655,578279,214698,963,3893,8.43,690,0,0,0.13,1038.01,613,55.12,1003.6,6196.22,11.78,935,-0.62,7.77,22.78]
["ES",2015,"J59",2,1,null,null,null,null,null,null,3,null,null,3,null,null,null,null,3,null,null,null,null,3]
["ES",2015,"J59","1a",1,null,null,null,575901,372732,141695,951,2964,5.32,679,0,0,0.1,1344.77,601,29.44,992.06,6003.2,13.32,923,-0.72,7.97,22.88]
["ES",2015,"J59","1b",1,null,null,null,241753,205546,73003,12,929,16.78,11,null,null,null,643.4,12,null,null,null,8.98,12]
["ES",2015,"J60",0,1,14.59,null,24.51,2916920,1730564,638045,215,3122,18.600000000000001,145,0,0.01,1.2,3917.9,139,-278.39999999999998,654.12,6212.58,31.77,212,-2.94,8.15,21.07]
["ES",2015,"J60",1,1,null,null,null,218075,125871,49125,212,1046,8.4499999999999993,142,0,0,0.75,3817.44,136,-303.88,629.5,6023.92,17.43,209,-3.16,7.95,21.06]
["ES",2015,"J60",2,1,null,null,null,null,null,null,3,null,null,3,null,null,null,null,3,null,null,null,null,3]
["ES",2015,"J60","1a",1,null,null,null,143114,69168,39322,210,1027,9.2799999999999994,140,0,0,0.7,2081.87,135,-309.47000000000003,621.29999999999995,5158.53,17.27,207,-3.61,7.85,21]
["ES",2015,"J60","1b",1,null,null,null,null,null,null,2,null,null,2,null,null,null,null,1,null,null,null,null,2]
["ES",2015,"J61",0,1,20.62,null,84.35,40429580,24715376,10556280,742,49804,0.21,538,0,0,0.16,2354.33,525,83.32,795.26,4179.99,17.82,723,-0.91,5.51,16.16]
["ES",2015,"J61",1,1,null,null,null,830639,840171,342497,722,6602,1.63,519,0,0,0.13,2937.02,507,30.29,762.06,4081.04,13.94,703,-1.49,5.4,15.94]
["ES",2015,"J61",2,1,null,null,null,39598940,23875205,10213782,20,43202,0.17,19,0.02,0.39,3.59,2341.64,18,871.59,3516.86,10808.98,17.96,20,5.65,14.85,31.09]
["ES",2015,"J61","1a",1,null,null,null,362422,350399,156796,701,4600,1.89,499,0,0,0.1,915.63,490,6.16,693.22,3639.19,7.82,682,-1.86,5.17,15.57]
["ES",2015,"J61","1b",1,null,null,null,468217,489771,185700,21,2002,1.56,20,null,null,null,9026.9,17,null,null,null,18.309999999999999,21]
["ES",2015,"J62",0,1,26.21,null,53.38,12685830,12705296,6205785,4610,111528,15.02,3459,0,0,0.28999999999999998,1046.53,2862,136.78,889.48,4927.37,7.64,4519,0.4,6.35,17.649999999999999]
["ES",2015,"J62",1,1,null,null,null,3544387,3507008,1999374,4577,44626,7.68,3428,0,0,0.26,1288.72,2831,133.82,883.05,4854.8100000000004,10.029999999999999,4486,0.38,6.33,17.670000000000002]
["ES",2015,"J62",2,1,null,null,null,9141442,9198287,4206410,33,66902,19.190000000000001,31,0.32,1.89,6.78,945.52,31,769.35,5677.01,26744.6,6.73,33,4.4400000000000004,7.35,10.59]
["ES",2015,"J62","1a",1,null,null,null,2197932,2113975,1207357,4513,28399,5.0599999999999996,3366,0,0,0.23,1072.53,2777,126.77,874.38,4694.8599999999997,9.43,4422,0.31,6.33,17.84]
["ES",2015,"J62","1b",1,null,null,null,1346455,1393033,792016,64,16227,11.11,62,0,0.71,2.66,1749.94,54,429.19,1260.98,6683.08,10.94,64,2.81,6.48,11.73]
["ES",2015,"J63",0,1,47.74,null,49.4,5759712,4095259,915547,792,7990,28.86,552,0,0,0.25,1360.04,439,-97.68,894.58,5302.11,20.64,767,-1.85,6.86,22.48]
["ES",2015,"J63",1,1,null,null,null,541368,424506,247530,790,6897,8.26,550,0,0,0.25,1486.23,437,-121.67,892,5271.52,12.56,765,-1.91,6.85,22.44]
["ES",2015,"J63",2,1,null,null,null,null,null,null,2,null,null,2,null,null,null,null,2,null,null,null,null,2]
["ES",2015,"J63","1a",1,null,null,null,431244,284376,142515,782,3570,13.42,542,0,0,0.24,1229.22,431,-136.72999999999999,888.62,5204.1099999999997,10.77,757,-2.11,6.85,22.04]
["ES",2015,"J63","1b",1,null,null,null,110123,140129,105015,8,3327,1.29,8,null,null,null,2070.37,6,null,null,null,16.2,8]
["ES",2015,"K642",0,1,50.05,null,14.91,93851306,62620,133183,467,438,95.97,340,0.03,69.680000000000007,100.79,243.86,255,13.49,263.85000000000002,4425.96,null,320]
["ES",2015,"L",0,1,21.8,null,29.41,94336156,6484647,2769820,22539,34218,25.49,17855,0,0,1.66,248.52,15575,123.86,615.96,3032.55,34.68,18912,6.4,42.62,77.239999999999995]
["ES",2015,"L",1,1,null,null,null,57450257,3809467,2576949,22520,29334,14.86,17844,0,0,1.65,463.77,15557,124.1,616.86,3033.17,51.64,18893,6.45,42.63,77.209999999999994]
["ES",2015,"L",2,1,null,null,null,36885899,2675180,192871,19,4884,99.68,11,null,23.52,null,58.59,18,-147.93,281.19,830.15,10.53,19,-33.14,24.5,88.58]
["ES",2015,"L","1a",1,null,null,null,50902339,3111991,2239358,22455,26998,13.68,17786,0,0,1.64,509.43,15498,124.03,618.87,3042.75,54.14,18832,6.39,42.56,77.180000000000007]
["ES",2015,"L","1b",1,null,null,null,6547917,697475,337590,65,2335,21.95,58,0.03,1.1599999999999999,20.57,302.19,59,127.83,428.42,1181.72,40.5,61,20.73,53.35,80.78]
["ES",2015,"L68",0,1,21.8,null,29.41,94336156,6484647,2769820,22539,34218,25.49,17855,0,0,1.66,248.52,15575,123.86,615.96,3032.55,34.68,18912,6.4,42.62,77.239999999999995]
["ES",2015,"L68",1,1,null,null,null,57450257,3809467,2576949,22520,29334,14.86,17844,0,0,1.65,463.77,15557,124.1,616.86,3033.17,51.64,18893,6.45,42.63,77.209999999999994]
["ES",2015,"L68",2,1,null,null,null,36885899,2675180,192871,19,4884,99.68,11,null,23.52,null,58.59,18,-147.93,281.19,830.15,10.53,19,-33.14,24.5,88.58]
["ES",2015,"L68","1a",1,null,null,null,50902339,3111991,2239358,22455,26998,13.68,17786,0,0,1.64,509.43,15498,124.03,618.87,3042.75,54.14,18832,6.39,42.56,77.180000000000007]
["ES",2015,"L68","1b",1,null,null,null,6547917,697475,337590,65,2335,21.95,58,0.03,1.1599999999999999,20.57,302.19,59,127.83,428.42,1181.72,40.5,61,20.73,53.35,80.78]
["ES",2015,"M",0,1,22.53,null,37.03,422184457,20923162,10743552,30740,193232,91.95,23058,0,0,0.65,276.41000000000003,19095,100.37,860.24,4938.3100000000004,92.83,29747,0.38,7.39,22.06]
["ES",2015,"M69",0,1,21.76,null,30.88,6207564,4035309,1933743,10351,42752,23.46,8143,0,0,0.82,678.1,6344,184.77,937.84,4538.3500000000004,11.39,10194,0.97,6.81,17.89]
["ES",2015,"M69",1,1,null,null,null,4856522,2778048,1442194,10341,36213,19.21,8133,0,0,0.81,1122.29,6335,184.28,937.86,4541.6400000000003,11.53,10184,0.97,6.81,17.899999999999999]
["ES",2015,"M69",2,1,null,null,null,1351041,1257261,491548,10,6538,33.229999999999997,10,null,1.36,null,355.07,9,null,725.43,null,11.09,10,null,8.11]
["ES",2015,"M69","1a",1,null,null,null,3983586,2219204,1156669,10308,31132,20.23,8104,0,0,0.8,1280.8699999999999,6305,183.66,937.83,4539.29,12.51,10151,0.97,6.81,17.899999999999999]
["ES",2015,"M69","1b",1,null,null,null,872936,558843,285525,33,5081,12.62,29,null,null,null,622.85,30,null,null,null,7.67,33]
["ES",2015,"M70",0,1,34.43,null,42.45,390874673,1764337,2175157,5159,34320,104.58,3880,0,0,3.25,247.17,3045,99.75,969.19,6726.22,951.72,4737,0.77,11.39,38.11]
["ES",2015,"M701",0,1,42.31,null,51.46,385875001,165261,1317829,779,16370,105.56,594,0.02,57.24,102.68,243.63,508,54.73,605.19000000000005,6427.48,null,523]
["ES",2015,"M702",0,1,33.33,null,36.6,4999671,1599076,857328,4380,17949,50.86,3286,0,0,0.74,1207.6099999999999,2537,116.4,1033.45,6810.79,18.809999999999999,4214,0.6,10.46,33.119999999999997]
["ES",2015,"M702",1,1,null,null,null,4225221,1178705,618441,4374,12621,43.34,3280,0,0,0.74,1025.28,2531,115.48,1031.92,6755.69,20.03,4208,0.6,10.48,33.130000000000003]
["ES",2015,"M702",2,1,null,null,null,774450,420371,238887,6,5328,78.28,6,null,0.06,null,3437.28,6,null,7869.57,null,15.4,6,null,2.84]
["ES",2015,"M702","1a",1,null,null,null,3714494,934706,510099,4359,11478,44.44,3266,0,0,0.73,1074.3599999999999,2520,114.78,1032.1500000000001,6703.78,20.91,4194,0.59,10.48,33.11]
["ES",2015,"M702","1b",1,null,null,null,510727,243998,108341,15,1143,38.03,14,null,null,null,840.48,11,null,null,null,16.649999999999999,14]
["ES",2015,"M71",0,1,15.03,null,38.74,16273832,8748602,3822360,6149,62861,9.1199999999999992,4453,0,0,0.4,1647.93,3992,3.76,800.18,5025.96,13.97,6008,-1.01,8.09,23.23]
["ES",2015,"M71",1,1,null,null,null,4370522,2898789,1458958,6129,30983,13.64,4434,0,0,0.38,1020.43,3972,0.76,795.64,4992.97,10.48,5988,-1.06,8.06,23.23]
["ES",2015,"M71",2,1,null,null,null,11903309,5849813,2363402,20,31878,7.62,19,2.35,5.32,19.72,2068.6799999999998,20,453.7,5115.6499999999996,16433.53,15.7,20,5.91,9.34,17.32]
["ES",2015,"M71","1a",1,null,null,null,3108488,1792080,870162,6077,19315,9.74,4392,0,0,0.34,991.43,3929,-0.68,801.73,4988.47,10.63,5936,-1.1200000000000001,8.1,23.26]
["ES",2015,"M71","1b",1,null,null,null,1262034,1106708,588795,52,11668,20.190000000000001,42,0.25,2.4300000000000002,14.24,1073.17,43,157.47,624.99,4247.13,10.24,52,2.59,6.43,15.85]
["ES",2015,"M72",0,1,22.55,null,47.94,1629597,812195,418020,496,6270,7.33,320,0,0,0.46,258.57,311,-249.23,498.34,3262.76,4.88,460,-4.95,7.09,25.36]
["ES",2015,"M72",1,1,null,null,null,1131007,398838,256327,494,4692,8.27,319,0,0,0.46,329.92,309,-247.17,498.34,3280.73,8.57,458,-4.5199999999999996,7.09,25.36]
["ES",2015,"M72",2,1,null,null,null,null,null,null,2,null,null,1,null,null,null,null,2,null,null,null,null,2]
["ES",2015,"M72","1a",1,null,null,null,671073,255511,154035,485,3503,56.5,310,0,0,0.45,69.150000000000006,301,-255.59,491.19,3244.8,1.88,449,-6.25,6.74,25.36]
["ES",2015,"M72","1b",1,null,null,null,459934,143327,102291,9,1188,null,9,null,null,null,null,8,null,null,null,null,9]
["ES",2015,"M73",0,1,11.72,null,17.25,1910100,2629456,681516,2760,14822,12.24,1996,0,0,0.23,2128.13,1760,6.58,826.51,5117.32,8.01,2704,-0.7,5.66,17.28]
["ES",2015,"M73",1,1,null,null,null,1476005,1526071,548826,2756,14249,18.57,1993,0,0,0.23,1229.8800000000001,1756,6.58,825.67,5095.05,7.82,2700,-0.7,5.67,17.3]
["ES",2015,"M73",2,1,null,null,null,null,null,null,4,null,null,3,null,null,null,null,4,null,null,null,null,4]
["ES",2015,"M73","1a",1,null,null,null,1228943,1110940,420076,2736,10917,21.16,1976,0,0,0.21,1133.97,1742,5.81,825.67,5067.3100000000004,8.7899999999999991,2680,-0.73,5.68,17.41]
["ES",2015,"M73","1b",1,null,null,null,247062,415130,128750,20,3332,6.83,17,null,null,null,1992.48,14,null,null,null,5.2,20]
["ES",2015,"M74",0,1,95.55,null,85.12,5180314,2798865,1660800,5320,30245,7.31,3884,0,0,0.32,1060.26,3259,11.68,807.23,4816.3900000000003,24.68,5142,-0.25,7.27,23.72]
["ES",2015,"M74",1,1,null,null,null,4182239,2293485,1251759,5313,27221,12.23,3878,0,0,0.33,1031.6199999999999,3253,11.6,802.04,4810.68,18.829999999999998,5136,-0.27,7.26,23.69]
["ES",2015,"M74",2,1,null,null,null,998075,505380,409041,7,3024,-0.9,6,null,0.03,null,1111.74,6,null,7541.28,null,51.23,6,null,12.69]
["ES",2015,"M74","1a",1,null,null,null,3304518,1469649,701892,5272,18226,18.29,3841,0,0,0.31,729.73,3221,8.59,793.89,4766.13,12.14,5096,-0.35,7.25,23.64]
["ES",2015,"M74","1b",1,null,null,null,877721,823836,549867,41,8994,7.97,37,0,0.38,2.0699999999999998,1455.54,32,404.22,2002.62,15223.59,30.76,40,3.74,8.99,32.71]
["ES",2015,"M75",0,1,30.87,null,34,108392,134395,51954,505,1960,1.39,382,0,0,0.03,743.26,384,145.80000000000001,666.73,2149.11,6.22,502,0.48,5.44,10.58]
["ES",2015,"M75",1,1,null,null,null,108392,134395,51954,505,1960,1.39,382,0,0,0.03,743.26,384,145.80000000000001,666.73,2149.11,6.22,502,0.48,5.44,10.58]
["ES",2015,"M75",2,1,null,null,null,null,null,null,0,null,null,0,null,null,null,null,0,null,null,null,null,0]
["ES",2015,"M75","1a",1,null,null,null,108392,134395,51954,505,1960,1.39,382,0,0,0.03,743.26,384,145.80000000000001,666.73,2149.11,6.22,502,0.48,5.44,10.58]
["ES",2015,"M75","1b",1,null,null,null,null,null,null,0,null,null,0,null,null,null,null,0,null,null,null,null,0]
["ES",2015,"MC",0,1,22.26,null,36.090000000000003,36309462,20757901,9425723,29961,176861,15.4,22464,0,0,0.53,1134.8900000000001,18587,104.23,866.98,4920.0600000000004,14.13,29224,0.36,7.3,21.5]
["ES",2015,"MC",1,1,null,null,null,20349901,11208333,5628461,29912,127942,19.48,22419,0,0,0.52,1006.94,18540,103,864.54,4908.47,12.97,29176,0.36,7.3,21.51]
["ES",2015,"MC",2,1,null,null,null,15959560,9549567,3797261,49,48919,11.39,45,7.0000000000000007E-2,2.2799999999999998,6.08,1296.96,47,499,3029.92,10746.91,15.48,48,4.93,9.2100000000000009,15.56]
["ES",2015,"MC","1a",1,null,null,null,16119485,7916489,3864890,29742,96533,22.85,22271,0,0,0.5,950.75,18402,101.21,864.13,4891.45,12.03,29008,0.34,7.3,21.53]
["ES",2015,"MC","1b",1,null,null,null,4230416,3291844,1763571,170,31408,13.07,148,0,0.85,8.14,1134.3599999999999,138,344.51,896.78,8025.4,15.23,168,2.92,7.08,18.61]
["ES",2015,"N",0,1,11.6,null,46.94,24234281,23908944,13921655,10639,527738,14.15,7967,0,0,0.43,743.65,7407,90.63,644.49,3095.65,7.91,10311,0.28000000000000003,5.72,18.47]
["ES",2015,"N",1,1,null,null,null,11913365,7467760,4283338,10564,162926,17.71,7900,0,0,0.41,686.96,7335,86.39,642.65,3107.73,10.15,10236,0.26,5.77,18.579999999999998]
["ES",2015,"N",2,1,null,null,null,12320916,16441183,9638317,75,364812,11.77,67,0.34,2.2400000000000002,15.05,787.06,72,310.16000000000003,1006.13,2569.38,6.9,75,2.12,3.38,6.41]
["ES",2015,"N","1a",1,null,null,null,8188134,4836247,2601027,10433,95447,16.27,7787,0,0,0.37,701.6,7219,78.3,643.04999999999995,3130.94,9.93,10107,0.23,5.82,18.66]
["ES",2015,"N","1b",1,null,null,null,3725230,2631513,1682310,131,67478,20.2,113,0.08,1.24,13.57,663.05,116,237.93,605.36,2495.0700000000002,10.56,129,1.29,3.49,13.47]
["ES",2015,"N77",0,1,12.48,null,22.05,5951500,1958902,997517,1962,10094,5.68,1490,0,0,0.27,821.42,1497,97.37,664.3,2742.49,36.299999999999997,1871,1.28,14.52,33.44]
["ES",2015,"N77",1,1,null,null,null,3580586,1128197,533671,1956,8599,12.4,1484,0,0,0.26,684.58,1491,94.27,664.3,2747.97,27.79,1865,1.27,14.43,33.369999999999997]
["ES",2015,"N77",2,1,null,null,null,2370914,830705,463846,6,1495,0.38,6,null,0.44,null,975.12,6,null,1037.92,null,47.86,6,null,43.76]
["ES",2015,"N77","1a",1,null,null,null,2142010,857907,401504,1940,7718,3.52,1468,0,0,0.26,689.57,1475,89.61,664.3,2765.47,21.38,1849,1.2,14.35,33.06]
["ES",2015,"N77","1b",1,null,null,null,1438576,270290,132167,16,881,null,16,null,null,null,null,16,null,null,null,null,16]
["ES",2015,"N78",0,1,12.51,null,54.09,1086059,2817448,2623556,308,113021,12.86,237,0,0.01,1.49,1681.9,210,210.05,732.37,4020.83,3.77,302,0.48,3.62,11.9]
["ES",2015,"N78",1,1,null,null,null,267781,547214,481151,296,20891,5.59,226,0,0.01,1.26,1177.47,198,205.58,611.59,4291.34,4.9800000000000004,290,0.44,3.75,12.65]
["ES",2015,"N78",2,1,null,null,null,818278,2270234,2142405,12,92130,15.37,11,null,0.83,null,1973.79,12,800.25,1906.07,3641.2,3.48,12,1.67,2.63,3.46]
["ES",2015,"N78","1a",1,null,null,null,141962,269367,221001,286,9190,5.93,216,0,0.01,1.21,726.89,189,173.68,580,4391.07,4.0599999999999996,280,0.41,3.8,12.83]
["ES",2015,"N78","1b",1,null,null,null,125819,277847,260150,10,11700,5.37,10,null,null,null,2015.06,9,null,null,null,5.87,10]
["ES",2015,"N79",0,1,19.53,null,40.950000000000003,1857672,5955944,696768,1353,16625,21.75,979,0,0,0.91,984.87,907,-29.82,442.6,2161.2800000000002,3.08,1317,-0.51,2.37,9.31]
["ES",2015,"N79",1,1,null,null,null,657414,1367272,240046,1346,5791,3.09,973,0,0,0.89,893.09,901,-30.01,442.01,2167.69,4.2300000000000004,1310,-0.51,2.36,9.3000000000000007]
["ES",2015,"N79",2,1,null,null,null,1200258,4588672,456722,7,10834,30.34,6,null,49.69,null,1033.78,6,null,1152.8399999999999,null,2.74,7,null,2.4900000000000002]
["ES",2015,"N79","1a",1,null,null,null,476105,892230,163178,1326,4439,5.83,956,0,0,0.84,646.16,888,-36.130000000000003,436.89,2158.0700000000002,3.27,1290,-0.54,2.36,9.35]
["ES",2015,"N79","1b",1,null,null,null,181309,475042,76868,20,1352,0.31,17,null,null,null,1458.07,13,null,null,null,6.05,20]
["ES",2015,"N80",0,1,26.88,null,49.52,1424091,2315970,1734949,446,58314,3.79,339,0,0,0.6,811.3,340,106.93,542.52,2219.8200000000002,8.6300000000000008,434,0.46,4.91,11.36]
["ES",2015,"N80",1,1,null,null,null,354490,564226,413552,435,15792,9.6999999999999993,332,0,0,0.52,358.36,329,112.8,556.14,2247.88,2.81,423,0.56999999999999995,4.9800000000000004,11.43]
["ES",2015,"N80",2,1,null,null,null,1069601,1751744,1321397,11,42522,3.28,7,null,15.28,null,910.43,11,null,181.58,null,10.51,11,null,1.1000000000000001]
["ES",2015,"N80","1a",1,null,null,null,225038,310052,214371,422,8020,4.75,326,0,0,0.45,612.75,316,141.57,581.02,2386.29,5.2,410,0.74,5.1100000000000003,11.63]
["ES",2015,"N80","1b",1,null,null,null,129451,254173,199181,13,7772,-305.72000000000003,6,null,null,null,-14.05,13,null,null,null,-0.1,13]
["ES",2015,"N81",0,1,18.88,null,55.89,5395409,6901201,5469302,2776,244690,16.32,2102,0,0,0.16,743.56,2093,114.78,612.58000000000004,2500.9499999999998,5.07,2756,0.28999999999999998,3.88,10.33]
["ES",2015,"N81",1,1,null,null,null,1609863,2023017,1567478,2756,79088,12,2082,0,0,0.14000000000000001,801.37,2073,111.51,611.96,2510.0500000000002,5.15,2736,0.24,3.88,10.38]
["ES",2015,"N81",2,1,null,null,null,3785546,4878184,3901824,20,165602,18.16,20,1.02,11.99,21.29,721.5,20,370.9,724.29,1846.13,5.04,20,2.96,3.99,4.97]
["ES",2015,"N81","1a",1,null,null,null,1030931,1322611,977312,2724,46489,5.86,2052,0,0,0.12,733.4,2044,91.87,614.9,2527.8200000000002,5.18,2704,0.2,3.94,10.4]
["ES",2015,"N81","1b",1,null,null,null,578931,700405,590165,32,32598,23.79,30,0.32,3.94,34.64,975.17,29,317.60000000000002,450,1211.54,5.08,32,1.2,2.2999999999999998,5.04]
["ES",2015,"N82",0,1,7.55,null,31.07,8519556,3959477,2399560,3794,84991,31.96,2820,0,0,0.82,479.19,2360,84.13,813.27,4530.1000000000004,8.61,3631,0.31,8.1300000000000008,26.31]
["ES",2015,"N82",1,1,null,null,null,5443237,1837832,1047437,3775,32762,32.61,2803,0,0,0.82,624.42999999999995,2343,80.92,799.32,4553.34,13.02,3612,0.27,8.2100000000000009,26.43]
["ES",2015,"N82",2,1,null,null,null,3076319,2121644,1352123,19,52229,30.45,17,-0.06,0.19,1.81,309.85000000000002,17,338.49,1085.47,3276.32,4.8,19,2.4,5.1100000000000003,6.41]
["ES",2015,"N82","1a",1,null,null,null,4172094,1184077,623660,3735,19589,37.520000000000003,2769,0,0,0.74,721.26,2307,71.959999999999994,797.16,4515.7700000000004,14.52,3574,0.26,8.1999999999999993,26.44]
["ES",2015,"N82","1b",1,null,null,null,1271143,653755,423777,40,13173,20.05,34,null,null,null,464.96,36,null,null,null,10.29,38]
["ES",2015,"P",0,1,16.05,null,20.51,2679269,2145745,1494671,4619,47150,18.28,3221,0,0,0.1,980.06,2978,-175.63,561.6,3140.15,11.79,4514,-1.88,4.97,14.24]
["ES",2015,"P",1,1,null,null,null,2453845,1994831,1421038,4617,45743,18.77,3219,0,0,0.09,1065.6099999999999,2976,-176.64,561.6,3135.3,12.18,4512,-1.9,4.96,14.25]
["ES",2015,"P",2,1,null,null,null,null,null,null,2,null,null,2,null,null,null,null,2,null,null,null,null,2]
["ES",2015,"P","1a",1,null,null,null,1746565,1547625,1092939,4593,37480,4.87,3196,0,0,0.08,969.37,2956,-189.06,556.37,3132.73,9.35,4488,-2,4.9400000000000004,14.21]
["ES",2015,"P","1b",1,null,null,null,707280,447205,328098,24,8262,39.229999999999997,23,null,null,null,1248.04,20,null,null,null,21.97,24]
["ES",2015,"P85",0,1,16.05,null,20.51,2679269,2145745,1494671,4619,47150,18.28,3221,0,0,0.1,980.06,2978,-175.63,561.6,3140.15,11.79,4514,-1.88,4.97,14.24]
["ES",2015,"P85",1,1,null,null,null,2453845,1994831,1421038,4617,45743,18.77,3219,0,0,0.09,1065.6099999999999,2976,-176.64,561.6,3135.3,12.18,4512,-1.9,4.96,14.25]
["ES",2015,"P85",2,1,null,null,null,null,null,null,2,null,null,2,null,null,null,null,2,null,null,null,null,2]
["ES",2015,"P85","1a",1,null,null,null,1746565,1547625,1092939,4593,37480,4.87,3196,0,0,0.08,969.37,2956,-189.06,556.37,3132.73,9.35,4488,-2,4.9400000000000004,14.21]
["ES",2015,"P85","1b",1,null,null,null,707280,447205,328098,24,8262,39.229999999999997,23,null,null,null,1248.04,20,null,null,null,21.97,24]
["ES",2015,"Q",0,1,25.5,null,33.89,8750605,7233932,4117024,7511,121198,8.94,6137,0,0,0.22,853.85,5044,271.27999999999997,1192.74,5067,14.54,7448,2.12,8.85,18.489999999999998]
["ES",2015,"Q",1,1,null,null,null,5996666,5092154,2823346,7493,86969,12.23,6121,0,0,0.21,1092.1300000000001,5026,271.52,1196.08,5075.74,13.79,7430,2.1,8.84,18.46]
["ES",2015,"Q",2,1,null,null,null,2753939,2141778,1293678,18,34228,2.3199999999999998,16,0.54,1.85,13.67,593.69000000000005,18,268.58,532.72,3975.04,16.329999999999998,18,5.92,12.17,21.29]
["ES",2015,"Q","1a",1,null,null,null,3970018,3402160,1796259,7412,56008,4.72,6043,0,0,0.19,1062.58,4952,264.06,1178.9000000000001,5044.45,12.65,7350,2.04,8.8000000000000007,18.420000000000002]
["ES",2015,"Q","1b",1,null,null,null,2026648,1689994,1027087,81,30960,24.11,78,0.14000000000000001,1.1299999999999999,6.21,1142.3900000000001,74,553.79,1469.02,7404.12,16.100000000000001,80,6.69,12.38,21.69]
["ES",2015,"Q86",0,1,25.84,null,33,6311743,5376937,2716340,6326,61641,10.039999999999999,5228,0,0,0.18,1002.98,4095,316.99,1345.9,5722,15.53,6272,2.44,9.2799999999999994,19.22]
["ES",2015,"Q86",1,1,null,null,null,4111731,3686161,1773634,6312,43981,14.64,5216,0,0,0.17,1450.38,4081,317.86,1345.9,5779.96,14.55,6258,2.42,9.27,19.2]
["ES",2015,"Q86",2,1,null,null,null,2200012,1690776,942706,14,17660,1.76,12,0.98,1.85,7.71,645.32000000000005,14,221.08,1425.05,4571.3900000000003,17.66,14,5.83,13.93,21.29]
["ES",2015,"Q86","1a",1,null,null,null,2739572,2473441,1131492,6255,28390,5.19,5162,0,0,0.16,1377.42,4030,315.82,1336.71,5642.76,13.36,6202,2.38,9.1999999999999993,19.18]
["ES",2015,"Q86","1b",1,null,null,null,1372159,1212719,642141,57,15590,29.82,54,0.16,1.1299999999999999,5.6,1585.13,51,838.82,2027.06,10760.4,16.98,56,7.72,12.79,20.66]
["ES",2015,"Q87",0,1,25.45,null,40.03,2020735,1433606,1048110,752,42676,4.4800000000000004,614,0,0.01,0.49,528.88,628,219.56,839.43,3153.49,12.71,746,2.2400000000000002,8.4600000000000009,16.32]
["ES",2015,"Q87",1,1,null,null,null,1466808,982604,697138,748,26108,4.05,610,0,0.01,0.47,600.79999999999995,624,217.4,843.33,3165.49,13.35,742,2.19,8.4600000000000009,16.32]
["ES",2015,"Q87",2,1,null,null,null,null,null,null,4,null,null,4,null,null,null,null,4,null,null,null,null,4]
["ES",2015,"Q87","1a",1,null,null,null,1073690,737003,513033,735,19968,2.89,597,0,0.01,0.45,607.28,612,213.15,848.81,3247.7,12.26,729,2.14,8.36,16.260000000000002]
["ES",2015,"Q87","1b",1,null,null,null,393118,245601,184104,13,6140,6.59,13,null,null,null,586.94000000000005,12,null,null,null,16.62,13]
["ES",2015,"Q88",0,1,21.39,null,26.29,418125,423389,352574,433,16880,5.88,295,0,0,0.1,632.64,321,-345.06,377.28,1872.49,8.1999999999999993,430,-2.68,3.27,12.26]
["ES",2015,"Q88",1,1,null,null,null,418125,423389,352574,433,16880,5.88,295,0,0,0.1,632.64,321,-345.06,377.28,1872.49,8.1999999999999993,430,-2.68,3.27,12.26]
["ES",2015,"Q88",2,1,null,null,null,null,null,null,0,null,null,0,null,null,null,null,0,null,null,null,null,0]
["ES",2015,"Q88","1a",1,null,null,null,156755,191715,151733,422,7650,5.92,284,0,0,0.08,583.1,310,-394.84,376.98,1867.4,4.95,419,-2.86,3.2,12.23]
["ES",2015,"Q88","1b",1,null,null,null,261370,231673,200840,11,9230,5.86,11,null,null,null,653.48,11,null,null,null,10.9,11]
["ES",2015,"R",0,1,17.22,null,17.79,5922426,3670456,1381935,4927,32211,6.27,3376,0,0,0.16,886.2,3433,-138.63,688.31,3864.09,14.83,4753,-4.32,6.88,18.739999999999998]
["ES",2015,"R",1,1,null,null,null,4572043,2943689,1055993,4920,27717,4.66,3369,0,0,0.15,882.83,3426,-142.15,684.45,3814.31,12.32,4746,-4.41,6.87,18.71]
["ES",2015,"R",2,1,null,null,null,1350383,726767,325942,7,4494,9.4700000000000006,7,null,3.95,null,893.01,7,null,6384.28,null,25.03,7,null,29.72]
["ES",2015,"R","1a",1,null,null,null,3088360,2030347,787614,4872,22878,5.0199999999999996,3325,0,0,0.14000000000000001,834.8,3382,-150.75,673.84,3759.97,12.39,4698,-4.54,6.81,18.670000000000002]
["ES",2015,"R","1b",1,null,null,null,1483682,913342,268379,48,4839,3.83,44,null,null,null,1015.28,44,null,null,null,12.15,48]
["ES",2015,"R90",0,1,12.89,null,8.59,329669,283797,99068,880,3147,5.58,576,0,0,0.05,805.49,555,-289.49,692.33,4141.4799999999996,7.44,848,-5.52,4.99,17.07]
["ES",2015,"R90",1,1,null,null,null,329669,283797,99068,880,3147,5.58,576,0,0,0.05,805.49,555,-289.49,692.33,4141.4799999999996,7.44,848,-5.52,4.99,17.07]
["ES",2015,"R90",2,1,null,null,null,null,null,null,0,null,null,0,null,null,null,null,0,null,null,null,null,0]
["ES",2015,"R90","1a",1,null,null,null,279688,222907,80325,877,2677,7.09,573,0,0,0.04,844.61,552,-293.43,703.11,4170.47,6.84,845,-5.54,4.95,17.34]
["ES",2015,"R90","1b",1,null,null,null,null,null,null,3,null,null,3,null,null,null,null,3,null,null,null,null,3]
["ES",2015,"R91",0,1,7.46,null,8.3000000000000007,84022,38255,21020,116,674,15.01,78,0,0,0.02,407.37,76,-605.73,458.11,1773.63,15.3,115,-7.16,4.46,14.83]
["ES",2015,"R91",1,1,null,null,null,84022,38255,21020,116,674,15.01,78,0,0,0.02,407.37,76,-605.73,458.11,1773.63,15.3,115,-7.16,4.46,14.83]
["ES",2015,"R91",2,1,null,null,null,null,null,null,0,null,null,0,null,null,null,null,0,null,null,null,null,0]
["ES",2015,"R91","1a",1,null,null,null,84022,38255,21020,116,674,15.01,78,0,0,0.02,407.37,76,-605.73,458.11,1773.63,15.3,115,-7.16,4.46,14.83]
["ES",2015,"R91","1b",1,null,null,null,null,null,null,0,null,null,0,null,null,null,null,0,null,null,null,null,0]
["ES",2015,"R92",0,1,29.61,null,35.549999999999997,1936106,1858905,561048,1383,9565,7.23,1174,0,0,0.42,1774.03,1028,480.57,1900.22,8619.3799999999992,16.190000000000001,1307,5.3,13.41,24.84]
["ES",2015,"R92",1,1,null,null,null,1577927,1525960,464145,1379,8186,4.2699999999999996,1170,0,0,0.41,1666.3,1024,478.16,1896.26,8619.3799999999992,15.8,1303,5.27,13.37,24.83]
["ES",2015,"R92",2,1,null,null,null,null,null,null,4,null,null,4,null,null,null,null,4,null,null,null,null,4]
["ES",2015,"R92","1a",1,null,null,null,1016128,924408,300436,1348,5895,4.24,1140,0,0,0.35,1426.26,995,466.26,1824.09,8143.27,16.02,1272,5.25,13.35,24.83]
["ES",2015,"R92","1b",1,null,null,null,561798,601552,163709,31,2290,4.3099999999999996,30,0.22,1.1100000000000001,5.55,2276.1,29,1538.73,7022.35,47592.86,15.46,31,6.23,15.88,24.63]
["ES",2015,"R93",0,1,16.38,null,17.21,3572628,1489499,700798,2548,18824,4.76,1548,0,0,0.1,535.72,1774,-539.73,315.27,2053.85,14.54,2483,-11.89,3.76,14.96]
["ES",2015,"R93",1,1,null,null,null,2580424,1095677,471759,2545,15709,4.8,1545,0,0,0.1,419.25,1771,-541.63,314.72000000000003,2020.7,8.6300000000000008,2480,-11.93,3.75,14.94]
["ES",2015,"R93",2,1,null,null,null,null,null,null,3,null,null,3,null,null,null,null,3,null,null,null,null,3]
["ES",2015,"R93","1a",1,null,null,null,1708521,844776,385831,2531,13630,5.33,1534,0,0,0.09,499.12,1759,-541.63,314.72000000000003,2020.7,9.76,2466,-11.99,3.68,14.93]
["ES",2015,"R93","1b",1,null,null,null,871902,250900,85927,14,2079,null,11,null,null,null,null,12,null,null,null,null,14]
["ES",2015,"S",0,1,21.2,null,38.049999999999997,2952817,2291922,1137649,5268,39325,10.99,3158,0,0,7.0000000000000007E-2,1091.92,3588,-892.73,336.14,1855.25,9.9,5171,-10.72,2.4,11.35]
["ES",2015,"S",1,1,null,null,null,2584499,1815395,958171,5265,34979,12.18,3155,0,0,7.0000000000000007E-2,1032.01,3585,-894,335.02,1851.08,11.09,5168,-10.75,2.4,11.34]
["ES",2015,"S",2,1,null,null,null,null,null,null,3,null,null,3,null,null,null,null,3,null,null,null,null,3]
["ES",2015,"S","1a",1,null,null,null,2099982,1460581,774168,5251,30845,11.6,3141,0,0,7.0000000000000007E-2,926.96,3573,-909.16,332.87,1816.05,10.050000000000001,5154,-10.8,2.35,11.31]
["ES",2015,"S","1b",1,null,null,null,484517,354813,184002,14,4134,13.73,14,null,null,null,1484.21,12,null,null,null,15.38,14]
["ES",2015,"S94",0,1,null,null,null,null,null,null,0,null,null,0,null,null,null,null,0,null,null,null,null,0]
["ES",2015,"S94",1,1,null,null,null,null,null,null,0,null,null,0,null,null,null,null,0,null,null,null,null,0]
["ES",2015,"S94",2,1,null,null,null,null,null,null,0,null,null,0,null,null,null,null,0,null,null,null,null,0]
["ES",2015,"S94","1a",1,null,null,null,null,null,null,0,null,null,0,null,null,null,null,0,null,null,null,null,0]
["ES",2015,"S94","1b",1,null,null,null,null,null,null,0,null,null,0,null,null,null,null,0,null,null,null,null,0]
["ES",2015,"S95",0,1,9.31,null,21.79,416614,715834,265478,733,6562,3.47,487,0,0,0.13,1094.72,520,-411.71,389.74,2114.5100000000002,3.12,729,-3.95,2.75,8.16]
["ES",2015,"S95",1,1,null,null,null,248424,375862,163835,732,4919,3.32,486,0,0,0.12,976.24,519,-415.04,388.26,2101.0300000000002,5.04,728,-3.97,2.75,8.17]
["ES",2015,"S95",2,1,null,null,null,null,null,null,1,null,null,1,null,null,null,null,1,null,null,null,null,1]
["ES",2015,"S95","1a",1,null,null,null,180346,244389,100353,728,3134,4.46,482,0,0,0.11,882.8,515,-423.75,372.45,2074.12,5.71,724,-4.0199999999999996,2.75,8.19]
["ES",2015,"S95","1b",1,null,null,null,null,null,null,4,null,null,4,null,null,null,null,4,null,null,null,null,4]
["ES",2015,"S96",0,1,26.72,null,44.73,2536203,1576087,872171,4535,32763,11.82,2671,0,0,7.0000000000000007E-2,1091.6199999999999,3068,-970.8,329.85,1795.86,12.98,4442,-12.23,2.34,12.15]
["ES",2015,"S96",1,1,null,null,null,2336075,1439532,794336,4533,30060,13.1,2669,0,0,7.0000000000000007E-2,1038.18,3066,-978.69,329.74,1788.26,12.67,4440,-12.23,2.34,12.13]
["ES",2015,"S96",2,1,null,null,null,null,null,null,2,null,null,2,null,null,null,null,2,null,null,null,null,2]
["ES",2015,"S96","1a",1,null,null,null,1919636,1216192,673814,4523,27710,12.36,2659,0,0,0.06,931.87,3058,-982.88,327.18,1760.09,10.92,4430,-12.28,2.2999999999999998,11.96]
["ES",2015,"S96","1b",1,null,null,null,416439,223340,120521,10,2349,15.1,10,null,null,null,1494.73,8,null,null,null,22.2,10]
["ES",2015,"Z0",0,1,21.38,null,42.44,1555045760,810061791,197626367,264701,3593839,31.13,197934,0,0,0.45,564.6,194861,84.32,567.41,2688.72,12.67,254941,0.23,5,15.92]
["ES",2015,"ZC",0,1,21.35,null,42.41,1169170759,809896529,196308538,263922,3577469,16.89,197340,0,0,0.44,754.95,194353,84.37,567.30999999999995,2684.74,10.64,254418,0.23,4.99,15.86]
["ES",2015,"ZC",1,1,null,null,null,323325558,222914600,70360999,262541,1791767,8.9700000000000006,196060,0,0,0.42,667.68,193043,81.25,563.23,2661.54,8.99,253041,0.21,4.97,15.87]
["ES",2015,"ZC",2,1,null,null,null,845845496,586981929,125947539,1381,1785701,19.29,1280,0.17,1.84,12.74,786.06,1310,456.02,1707.57,6597.87,11.27,1377,3.23,7.03,14.71]
["ES",2015,"ZC","1a",1,null,null,null,233183276,144914760,48230608,258709,1347472,8.35,192461,0,0,0.38,605.07000000000005,189586,71.930000000000007,553.49,2623.9,8.5,249223,0.14000000000000001,4.95,15.96]
["ES",2015,"ZC","1b",1,null,null,null,90142282,77999839,22130391,3832,444294,9.9700000000000006,3599,0.06,0.85,4.3499999999999996,800.07,3457,409.06,1205.06,5233.71,9.8800000000000008,3818,2.58,5.82,12.15]
["ES",2014,"A",0,-1,null,null,null,11256536,6620739,1506838,7844,45698,9.25,5837,0,0.02,0.67,566.95000000000005,5950,106.84,543.41999999999996,2477.77,8.67,7390,1.22,9.7799999999999994,25.71]
["ES",2014,"A",1,-1,null,null,null,10345946,4896176,1352302,7829,43326,8.1,5822,0,0.02,0.66,541.72,5935,104.23,541.41,2493.09,9.98,7375,1.21,9.81,25.82]
["ES",2014,"A",2,-1,null,null,null,910590,1724563,154536,15,2371,15.82,15,0.37,2.2000000000000002,5.97,772.29,15,537.26,663.53,1126.52,4.96,15,3.28,4.8099999999999996,8.14]
["ES",2014,"A","1a",-1,null,null,null,9092281,3538737,1117588,7762,37239,8.81,5758,0,0.02,0.64,519.51,5871,99.6,537.29999999999995,2507.64,11.13,7308,1.1599999999999999,9.9,26.04]
["ES",2014,"A","1b",-1,null,null,null,1253664,1357439,234713,67,6086,5.16,64,0.1,0.73,4.66,658.84,64,265.69,691.17,1836.43,6.98,67,2.11,5,9.9]
["ES",2014,"A01",0,-1,null,null,null,9999374,5867476,1229438,7067,39324,8.26,5271,0,0.02,0.63,545.75,5363,107.25,537.29999999999995,2440.2199999999998,8.44,6669,1.26,10.15,27.07]
["ES",2014,"A01",1,-1,null,null,null,9279944,4250357,1109401,7053,37311,8.4600000000000009,5257,0,0.02,0.63,516.94000000000005,5349,104.16,535.70000000000005,2447.2199999999998,10.02,6655,1.26,10.18,27.11]
["ES",2014,"A01",2,-1,null,null,null,719429,1617119,120036,14,2012,7.01,14,0.32,1.96,4.58,831.86,14,527.95000000000005,677.51,1140.33,4.2699999999999996,14,3.18,4.46,8.02]
["ES",2014,"A01","1a",-1,null,null,null,8303565,3037391,905565,6995,31995,9.6,5200,0,0.02,0.6,486.53,5293,99.22,533.49,2461.83,11.08,6597,1.2,10.28,27.32]
["ES",2014,"A01","1b",-1,null,null,null,976379,1212965,203836,58,5316,4.16,57,0.06,0.71,3.6,675.43,56,297.01,701.56,1836.43,7.39,58,2.2599999999999998,5.18,9.93]
["ES",2014,"A02",0,-1,null,null,null,419736,265830,82906,439,2975,7.86,298,0,0.01,0.5,620.76,309,11.38,489.16,2208.75,5.92,406,-2.1800000000000002,5.32,14.34]
["ES",2014,"A02",1,-1,null,null,null,419736,265830,82906,439,2975,7.86,298,0,0.01,0.5,620.76,309,11.38,489.16,2208.75,5.92,406,-2.1800000000000002,5.32,14.34]
["ES",2014,"A02",2,-1,null,null,null,null,null,null,0,null,null,0,null,null,null,null,0,null,null,null,null,0]
["ES",2014,"A02","1a",-1,null,null,null,363635,194401,66684,435,2415,7.58,294,0,0.01,0.48,586.16999999999996,306,-6.63,488.44,2190.66,6.73,402,-2.3199999999999998,5.32,14.44]
["ES",2014,"A02","1b",-1,null,null,null,null,null,null,4,null,null,4,null,null,null,null,3,null,null,null,null,4]
["ES",2014,"A03",0,-1,null,null,null,837426,487432,194494,338,3398,17.37,268,0,0.1,2.2400000000000002,790.24,278,188.86,828.58,2881.66,12.98,315,2.29,9.61,17.32]
["ES",2014,"A03",1,-1,null,null,null,646265,379988,159994,337,3039,4.91,267,0,0.1,2.21,894.46,277,188.67,842.2,2887.5,12.3,314,2.29,9.52,17.36]
["ES",2014,"A03",2,-1,null,null,null,null,null,null,1,null,null,1,null,null,null,null,1,null,null,null,null,1]
["ES",2014,"A03","1a",-1,null,null,null,425080,306944,145338,332,2829,3.12,264,0,0.09,2.14,1002.58,272,189.24,855.37,3146.28,14.41,309,2.29,9.61,17.41]
["ES",2014,"A03","1b",-1,null,null,null,null,null,null,5,null,null,3,null,null,null,null,5,null,null,null,null,5]
["ES",2014,"B",0,-1,null,null,null,6150939,1272564,455919,620,7091,29.09,413,0,0.11,4.08,504.5,514,-231.03,317.92,1816.64,16.190000000000001,581,-3.16,6.42,16.98]
["ES",2014,"B",1,-1,null,null,null,2150758,659132,218355,616,4621,40.950000000000003,410,0,0.11,3.98,737.12,510,-231.03,323,1816.64,14.24,577,-3.16,6.4,16.93]
["ES",2014,"B",2,-1,null,null,null,null,null,null,4,null,null,3,null,null,null,null,4,null,null,null,null,4]
["ES",2014,"B","1a",-1,null,null,null,1279293,489270,167929,605,4025,16.13,402,0,0.1,3.94,528.74,502,-231.03,314.17,1808.08,10.01,567,-3.06,6.35,16.89]
["ES",2014,"B","1b",-1,null,null,null,871465,169861,50426,11,596,null,8,null,null,null,null,8,null,null,null,null,10]
["ES",2014,"B05",0,-1,null,null,null,251386,59491,25366,10,223,5.77,8,null,null,null,3791.65,7,null,null,null,16.010000000000002,9]
["ES",2014,"B05",1,-1,null,null,null,251386,59491,25366,10,223,null,8,null,null,null,null,7,null,null,null,null,9]
["ES",2014,"B05",2,-1,null,null,null,null,null,null,0,null,null,0,null,null,null,null,0,null,null,null,null,0]
["ES",2014,"B05","1a",-1,null,null,null,14548,11959,3624,7,41,null,5,null,null,null,1059.98,6,null,null,null,15.44,7]
["ES",2014,"B05","1b",-1,null,null,null,null,null,null,3,null,null,3,null,null,null,null,1,null,null,null,null,2]
["ES",2014,"B06",0,-1,null,null,null,null,null,null,5,null,null,2,null,null,null,null,3,null,null,null,null,5]
["ES",2014,"B06",1,-1,null,null,null,null,null,null,4,null,null,2,null,null,null,null,2,null,null,null,null,4]
["ES",2014,"B06",2,-1,null,null,null,null,null,null,1,null,null,0,null,null,null,null,1,null,null,null,null,1]
["ES",2014,"B06","1a",-1,null,null,null,null,null,null,4,null,null,2,null,null,null,null,2,null,null,null,null,4]
["ES",2014,"B06","1b",-1,null,null,null,null,null,null,0,null,null,0,null,null,null,null,0,null,null,null,null,0]
["ES",2014,"B07",0,-1,null,null,null,727264,122243,63043,10,545,null,5,null,null,null,295.45999999999998,6,null,null,null,35.380000000000003,7]
["ES",2014,"B07",1,-1,null,null,null,7075,285,162,9,2,null,4,null,null,null,null,5,null,null,null,null,6]
["ES",2014,"B07",2,-1,null,null,null,null,null,null,1,null,null,1,null,null,null,null,1,null,null,null,null,1]
["ES",2014,"B07","1a",-1,null,null,null,7075,285,162,9,2,null,4,null,null,null,null,5,null,null,null,null,6]
["ES",2014,"B07","1b",-1,null,null,null,null,null,null,0,null,null,0,null,null,null,null,0,null,null,null,null,0]
["ES",2014,"B08",0,-1,null,null,null,2778121,967158,334162,573,5820,34.71,384,0,0.12,4.25,654.41999999999996,485,-242.53,326.79000000000002,1817.36,17.36,541,-3.48,6.46,16.93]
["ES",2014,"B08",1,-1,null,null,null,1766462,564403,194262,571,4206,40.42,382,0,0.12,4.0599999999999996,746.77,483,-244.01,326.79000000000002,1815.92,16.11,539,-3.66,6.46,16.920000000000002]
["ES",2014,"B08",2,-1,null,null,null,null,null,null,2,null,null,2,null,null,null,null,2,null,null,null,null,2]
["ES",2014,"B08","1a",-1,null,null,null,1219150,450867,156280,564,3792,16.38,377,0,0.12,3.98,509.08,477,-245.49,316.64,1814.47,10,532,-3.57,6.43,16.66]
["ES",2014,"B08","1b",-1,null,null,null,547312,113535,37982,7,414,null,5,null,null,null,null,6,null,null,null,null,7]
["ES",2014,"B09",0,-1,null,null,null,124627,32937,-2892,22,155,null,14,0,0,0.25,-2478.1,13,65.87,270.77,825.77,-21.77,19,-0.95,3.12,14.38]
["ES",2014,"B09",1,-1,null,null,null,124627,32937,-2892,22,155,null,14,0,0,0.25,-2478.1,13,65.87,270.77,825.77,-21.77,19,-0.95,3.12,14.38]
["ES",2014,"B09",2,-1,null,null,null,null,null,null,0,null,null,0,null,null,null,null,0,null,null,null,null,0]
["ES",2014,"B09","1a",-1,null,null,null,37312,24143,6405,21,155,4.3600000000000003,14,null,null,null,678.27,12,null,null,null,6.05,18]
["ES",2014,"B09","1b",-1,null,null,null,null,null,null,1,null,null,0,null,null,null,null,1,null,null,null,null,1]
["ES",2014,"C",0,-1,null,null,null,213453465,240168999,41856245,30126,664353,17.899999999999999,22931,0,0.02,0.86,770.92,25098,112.51,457.13,2043.71,7.02,29421,0.69,4.79,10.27]
["ES",2014,"C",1,-1,null,null,null,50848470,47797925,14362651,29634,329844,7.02,22469,0,0.01,0.78,701.02,24632,109.27,445.65,1982.22,8.0399999999999991,28929,0.63,4.72,10.19]
["ES",2014,"C",2,-1,null,null,null,162604995,192371074,27493593,492,334509,21.12,462,0.27,1.8,9.09,794.31,466,499.36,1576.97,6498.4,6.77,492,4.53,8.56,14.11]
["ES",2014,"C","1a",-1,null,null,null,28524828,25474290,8565852,28572,231230,5.27,21463,0,0.01,0.66,562.26,23628,97.21,424.59,1897.53,6.85,27868,0.45,4.57,10.029999999999999]
["ES",2014,"C","1b",-1,null,null,null,22323642,22323634,5796798,1062,98613,8.4700000000000006,1006,0.09,1.1100000000000001,4.8099999999999996,881.69,1004,392.17,1124.05,4407.72,9.41,1061,4.26,8.0399999999999991,13.07]
["ES",2014,"C10",0,-1,null,null,null,23292366,30076939,5511743,3924,104797,9.2899999999999991,3149,0,0.02,0.68,764.35,3252,178.55,577.75,2319.5300000000002,7.77,3824,1.37,4.57,9.07]
["ES",2014,"C10",1,-1,null,null,null,8079040,8968088,2001320,3820,51899,6.53,3047,0,0.01,0.62,723.83,3152,171.89,557.04999999999995,2270.1999999999998,7.41,3720,1.28,4.5,9.02]
["ES",2014,"C10",2,-1,null,null,null,15213326,21108851,3510422,104,52897,10.39,102,0.23,1.1499999999999999,4.3499999999999996,781.75,100,466.4,1204.49,4316.8900000000003,7.92,104,3.82,6.86,10.89]
["ES",2014,"C10","1a",-1,null,null,null,3895888,3960705,1031376,3588,33278,5.42,2823,0,0.01,0.46,599.22,2927,161.28,529.5,2169.4899999999998,6.57,3488,1.04,4.4000000000000004,8.89]
["ES",2014,"C10","1b",-1,null,null,null,4183151,5007383,969943,232,18621,7.23,224,7.0000000000000007E-2,1,4.83,835.75,225,377.44,1059.6600000000001,3280.69,8.08,232,3.45,6.15,10.99]
["ES",2014,"C11",0,-1,null,null,null,8602141,6117769,1795050,846,14150,9.19,603,0,0.03,0.84,2143.91,679,0.42,372.53,1909.3,17.54,813,-1.19,8.07,17.59]
["ES",2014,"C11",1,-1,null,null,null,2693776,1259616,328250,830,5566,14.31,587,0,0.02,0.71,853.57,667,-8.36,358.29,1741.13,13.74,797,-1.66,7.85,17.43]
["ES",2014,"C11",2,-1,null,null,null,5908365,4858153,1466800,16,8584,8.1999999999999993,16,0.4,3.17,5.29,3022.99,12,1526.04,2706.28,14075.94,18.52,16,12.09,18.79,22.72]
["ES",2014,"C11","1a",-1,null,null,null,1654731,710991,196529,803,4175,5.36,562,0,0.02,0.54,511.94,641,-24.12,335.2,1526.77,10.77,770,-2.06,7.78,17.36]
["ES",2014,"C11","1b",-1,null,null,null,1039045,548624,131721,27,1391,21.4,25,0.14000000000000001,0.85,4.54,1813.25,26,717.32,3134.44,12223.78,17.59,27,6.6,12.4,18]
["ES",2014,"C12",0,-1,null,null,null,4786509,976736,463664,9,2372,48.74,8,null,null,null,508.38,7,null,null,null,64.459999999999994,9]
["ES",2014,"C12",1,-1,null,null,null,null,null,null,5,null,null,4,null,null,null,null,5,null,null,null,null,5]
["ES",2014,"C12",2,-1,null,null,null,null,null,null,4,null,null,4,null,null,null,null,2,null,null,null,null,4]
["ES",2014,"C12","1a",-1,null,null,null,null,null,null,5,null,null,4,null,null,null,null,5,null,null,null,null,5]
["ES",2014,"C12","1b",-1,null,null,null,null,null,null,0,null,null,0,null,null,null,null,0,null,null,null,null,0]
["ES",2014,"C13",0,-1,null,null,null,1732473,1775724,466487,1139,12686,6.17,914,0,0.02,1.37,596.35,961,165.82,487.54,2071.59,6.47,1118,1.37,4.72,9.23]
["ES",2014,"C13",1,-1,null,null,null,1596123,1622883,437603,1137,12207,6.75,912,0,0.02,1.36,589.21,959,164.9,487.54,2063.44,6.27,1116,1.37,4.7,9.23]
["ES",2014,"C13",2,-1,null,null,null,null,null,null,2,null,null,2,null,null,null,null,2,null,null,null,null,2]
["ES",2014,"C13","1a",-1,null,null,null,1115441,1118087,312687,1111,9702,5.12,886,0,0.01,1.1200000000000001,482.78,933,160.34,478.05,1993.07,5.59,1090,1.35,4.6100000000000003,9.16]
["ES",2014,"C13","1b",-1,null,null,null,480681,504796,124916,26,2505,9.32,26,0.6,1.35,3.43,906.94,26,387.52,1037.95,3713.26,7.79,26,4.2699999999999996,6.28,11.98]
["ES",2014,"C14",0,-1,null,null,null,1476502,2109131,469725,875,13307,6.81,598,0,0,1.17,810.28,659,-30.55,242.48,1049.72,5.52,845,-1.82,3.12,8.15]
["ES",2014,"C14",1,-1,null,null,null,768939,789988,218211,862,7740,11.7,590,0,0,1.21,431.07,646,-27.23,239,1033.69,5.38,832,-2.12,3.16,8.17]
["ES",2014,"C14",2,-1,null,null,null,707562,1319143,251514,13,5567,3.99,8,null,0.42,null,1642.62,13,-1537.27,2394.0700000000002,29300,5.6,13,-0.91,0.98,1.72]
["ES",2014,"C14","1a",-1,null,null,null,562777,543245,172035,850,6803,17.7,578,0,0,1.02,357.75,634,-41.21,228.4,1024.47,4.5599999999999996,820,-2.6,3.12,8.1300000000000008]
["ES",2014,"C14","1b",-1,null,null,null,206161,246743,46175,12,936,3.32,12,null,null,null,603.82000000000005,12,null,null,null,7.2,12]
["ES",2014,"C15",0,-1,null,null,null,951632,1572096,389707,836,12122,4.8600000000000003,717,0,0.01,0.77,878.23,683,175.9,492.89,2917.4,6.3,815,1.52,3.53,6.87]
["ES",2014,"C15",1,-1,null,null,null,861932,1393917,331850,834,11092,1.9,715,0,0.01,0.77,653.80999999999995,681,175.56,492.61,2900,5.21,813,1.51,3.53,6.84]
["ES",2014,"C15",2,-1,null,null,null,null,null,null,2,null,null,2,null,null,null,null,2,null,null,null,null,2]
["ES",2014,"C15","1a",-1,null,null,null,506353,852114,224038,807,8837,2.23,689,0,0,0.72,498.57,657,169.43,492.61,2791.28,4.1900000000000004,786,1.5,3.49,6.82]
["ES",2014,"C15","1b",-1,null,null,null,355578,541802,107811,27,2255,1.58,26,null,null,null,935.88,24,null,null,null,6.81,27]
["ES",2014,"C16",0,-1,null,null,null,2673521,2291318,571712,1572,14696,21.88,1107,0,0.01,0.47,497.59,1327,-91.4,296.13,1277.57,7.12,1538,-1.66,3.95,8.34]
["ES",2014,"C16",1,-1,null,null,null,1889819,1516875,419015,1568,12002,24.44,1104,0,0.01,0.45,430.4,1323,-94.19,296.13,1277.57,6.75,1534,-1.68,3.96,8.34]
["ES",2014,"C16",2,-1,null,null,null,null,null,null,4,null,null,3,null,null,null,null,4,null,null,null,null,4]
["ES",2014,"C16","1a",-1,null,null,null,1248617,1175303,336259,1549,10247,5.1100000000000003,1085,0,0.01,0.4,412.72,1304,-118.23,290.39999999999998,1272.73,5.17,1515,-1.89,3.92,8.32]
["ES",2014,"C16","1b",-1,null,null,null,641201,341572,82755,19,1754,null,19,null,null,null,null,19,null,null,null,null,19]
["ES",2014,"C17",0,-1,null,null,null,7701265,5519907,1229812,441,16374,20.329999999999998,371,0,0.11,1.64,543.04,387,198.62,617.47,2513.9,10.74,435,2.2400000000000002,5.78,10.62]
["ES",2014,"C17",1,-1,null,null,null,1493336,1593704,399600,425,8696,3.22,358,0,0.1,1.41,768.79,371,198.62,617.16999999999996,2490.5,7.19,419,2.2400000000000002,5.73,10.07]
["ES",2014,"C17",2,-1,null,null,null,6207929,3926202,830211,16,7678,24.43,13,0.41,3.1,18.899999999999999,507.35,16,210.63,1682.28,4846.54,12.18,16,3,9.14,22.73]
["ES",2014,"C17","1a",-1,null,null,null,576249,618760,175353,385,4733,3.88,322,0,0.05,1.04,551.54999999999995,332,185.66,519.41,2205.4299999999998,7,379,2.2400000000000002,5.62,9.73]
["ES",2014,"C17","1b",-1,null,null,null,917086,974943,224247,40,3962,2.82,36,0.25,1.49,3.91,1011.07,39,432.73,1158.26,6270.38,7.3,40,2.4,7.03,11.24]
["ES",2014,"C18",0,-1,null,null,null,2671632,2143732,844839,2242,18114,6.64,1693,0,0,0.41,868.71,1848,116.01,461.45,1885.59,11.01,2206,0.46,6.18,12.54]
["ES",2014,"C18",1,-1,null,null,null,2235517,1902917,721132,2240,16599,7.3,1691,0,0,0.4,692.96,1848,116.01,461.45,1885.59,9.89,2204,0.46,6.18,12.54]
["ES",2014,"C18",2,-1,null,null,null,null,null,null,2,null,null,2,null,null,null,null,0,null,null,null,null,2]
["ES",2014,"C18","1a",-1,null,null,null,1628921,1388489,529630,2209,13559,5.6,1662,0,0,0.36,593.95000000000005,1817,113.31,448.61,1807.93,9.0299999999999994,2173,0.43,6.1,12.5]
["ES",2014,"C18","1b",-1,null,null,null,606596,514427,191502,31,3040,10.71,29,null,null,null,1037.48,31,null,null,null,12.23,31]
["ES",2014,"C19",0,-1,null,null,null,23263168,43509634,25259,8,8019,null,5,null,null,null,-96.12,7,null,null,null,-0.39,8]
["ES",2014,"C19",1,-1,null,null,null,null,null,null,4,null,null,3,null,null,null,null,3,null,null,null,null,4]
["ES",2014,"C19",2,-1,null,null,null,null,null,null,4,null,null,2,null,null,null,null,4,null,null,null,null,4]
["ES",2014,"C19","1a",-1,null,null,null,null,null,null,3,null,null,2,null,null,null,null,2,null,null,null,null,3]
["ES",2014,"C19","1b",-1,null,null,null,null,null,null,1,null,null,1,null,null,null,null,1,null,null,null,null,1]
["ES",2014,"C20",0,-1,null,null,null,15929019,21916627,3297647,1004,34702,11.66,820,0,0.14000000000000001,1.97,1553.82,854,189.11,638.53,3462.91,7.53,973,2.33,6.22,11.57]
["ES",2014,"C20",1,-1,null,null,null,2949846,3023035,806906,947,13937,3.97,766,0,0.11,1.63,1043.73,800,179.1,600.85,3056.12,9.48,916,2.25,6.13,11.14]
["ES",2014,"C20",2,-1,null,null,null,12979172,18893592,2490741,57,20765,13.27,54,0.26,2.2200000000000002,14.32,1731.73,54,1081.21,4352.1000000000004,12150.16,7.22,57,5.35,8.93,17.899999999999999]
["ES",2014,"C20","1a",-1,null,null,null,1176233,1118097,325605,857,7133,5.18,679,0,0.06,1.29,728.01,718,155.31,528.24,2438.09,7.97,826,1.95,5.74,10.69]
["ES",2014,"C20","1b",-1,null,null,null,1773612,1904938,481300,90,6803,3.42,87,0.16,0.85,4.1900000000000004,1297.51,82,521.99,2204.13,8078.88,10.37,90,5.93,9.84,14.38]
["ES",2014,"C21",0,-1,null,null,null,10661464,7567651,2334668,110,22367,14.92,96,0,0.37,2.5499999999999998,1454.92,81,368.72,1935.04,11764.29,14.98,100,6.85,14.11,23.39]
["ES",2014,"C21",1,-1,null,null,null,679184,508446,226174,77,3170,3.13,64,0,0.11,0.87,1295.76,50,263.63,919.29,7755.56,17.2,67,5.5,13.19,23.67]
["ES",2014,"C21",2,-1,null,null,null,9982279,7059205,2108494,33,19197,15.9,32,0.74,2.12,16.97,1470.01,31,1136.29,3044.78,17171.330000000002,14.82,33,8.7200000000000006,14.71,21.22]
["ES",2014,"C21","1a",-1,null,null,null,140434,96010,44320,61,779,1.93,48,0,0.04,0.87,848.09,39,239.15,533.46,8908.74,17.48,51,3.99,11.74,26.39]
["ES",2014,"C21","1b",-1,null,null,null,538749,412436,181853,16,2391,3.41,16,0.01,0.25,1.03,1481.6,11,null,1574.54,null,17.13,16,11.33,15.75,21.28]
["ES",2014,"C22",0,-1,null,null,null,6764473,8795991,2353514,1125,33123,7.08,963,0,0.05,0.89,1580.72,982,237.49,653.62,2390.35,11.92,1106,2.89,6.54,12.32]
["ES",2014,"C22",1,-1,null,null,null,2844701,3176121,904982,1099,18085,5.35,937,0,0.04,0.8,939.93,956,232.66,616.09,2325.33,9.59,1080,2.84,6.46,12.28]
["ES",2014,"C22",2,-1,null,null,null,3919771,5619869,1448531,26,15038,7.78,26,0.68,1.51,3.31,2193.19,26,1239.3499999999999,3272.58,5723.96,13.23,26,8.3699999999999992,10.02,13.92]
["ES",2014,"C22","1a",-1,null,null,null,1381009,1432183,458669,1020,10882,3.29,860,0,0.03,0.72,776.33,880,212.12,591.44000000000005,2219.73,8.7799999999999994,1001,2.58,6.21,11.97]
["ES",2014,"C22","1b",-1,null,null,null,1463692,1743937,446312,79,7202,6.8,77,0.03,0.52,4.33,1103.32,76,504.93,1165.6600000000001,3636.01,10.26,79,5.7,9,15.47]
["ES",2014,"C23",0,-1,null,null,null,14136852,4952092,1365931,1511,25207,39.950000000000003,947,0,0.03,1.41,272.12,1324,-454.33,213.6,907.84,10.24,1481,-6.71,3.25,8.99]
["ES",2014,"C23",1,-1,null,null,null,3666751,2220752,621212,1490,15653,15,928,0,0.03,1.3,329.21,1303,-489.55,208.57,903.59,5.15,1460,-7.02,3.11,8.77]
["ES",2014,"C23",2,-1,null,null,null,10470100,2731339,744718,21,9554,47.22,19,0.7,2.92,34.85,259.05,21,273.16000000000003,565.05999999999995,3881.17,14.38,21,8.69,12.54,17.559999999999999]
["ES",2014,"C23","1a",-1,null,null,null,2325435,1156835,346992,1435,10691,20.27,883,0,0.02,1.18,220.48,1250,-515.44000000000005,195.44,880.34,3.43,1405,-7.24,2.83,8.5399999999999991]
["ES",2014,"C23","1b",-1,null,null,null,1341315,1063916,274220,55,4962,12.2,45,0.26,0.74,4.17,446.21,53,206.26,500,1767.68,7.02,55,4.6900000000000004,7.61,10.79]
["ES",2014,"C24",0,-1,null,null,null,17484630,18350502,2569944,664,34472,27.65,545,0,0.03,1.48,522.04999999999995,585,149.56,456.32,2300,6.19,648,1.79,5.28,10.65]
["ES",2014,"C24",1,-1,null,null,null,1592072,1594088,435639,624,8878,15.72,509,0,0.02,1.17,585.4,545,144.38999999999999,446.29,2300,7.65,608,1.75,5.23,10.61]
["ES",2014,"C24",2,-1,null,null,null,15892558,16756414,2134304,40,25594,29.08,36,0.09,1.31,7.21,515.34,40,298.56,656.71,2084.4,6.05,40,2.67,6.11,10.71]
["ES",2014,"C24","1a",-1,null,null,null,721926,644339,217886,577,5171,5.66,466,0,0.02,0.95,491.37,500,140.54,437.24,2262.09,6.57,561,1.66,5.17,10.59]
["ES",2014,"C24","1b",-1,null,null,null,870145,949748,217753,47,3706,21.06,43,0,0.36,2.88,651.66999999999996,45,249.01,600,3180,8.39,47,2.91,5.98,10.62]
["ES",2014,"C25",0,-1,null,null,null,9344638,9076155,3017748,5429,62442,8.49,4151,0,0.01,0.68,750.96,4643,115.25,467.42,1967.46,8.98,5330,0.84,4.9400000000000004,10.45]
["ES",2014,"C25",1,-1,null,null,null,6843772,6631245,2381343,5405,53052,4.78,4127,0,0.01,0.66,693.25,4619,113.88,464.69,1962.14,8.2899999999999991,5306,0.81,4.92,10.41]
["ES",2014,"C25",2,-1,null,null,null,2500866,2444910,636405,24,9390,16.2,24,0.33,2.4,13.96,907.57,24,742.46,1473.53,2907.8,10.85,24,8.11,10.86,13.91]
["ES",2014,"C25","1a",-1,null,null,null,4544538,4215273,1699682,5288,41781,3.94,4015,0,0,0.57999999999999996,612,4505,106.63,452.89,1933.06,7.39,5189,0.66,4.8,10.35]
["ES",2014,"C25","1b",-1,null,null,null,2299233,2415971,681661,117,11270,5.86,112,0.18,1.58,6.98,838.84,114,437.67,935.1,2543.61,9.8699999999999992,117,5.7,8.27,12.68]
["ES",2014,"C26",0,-1,null,null,null,1229469,1144776,366286,418,6722,12.7,308,0,0.02,1.1200000000000001,779.49,320,90.18,490.87,2080.19,8.08,398,0.45,5.1100000000000003,11.63]
["ES",2014,"C26",1,-1,null,null,null,973619,794591,274030,413,5369,14.71,303,0,0.01,1.06,500.31,315,78.95,481.52,1975.85,7.27,393,0.4,5,11.66]
["ES",2014,"C26",2,-1,null,null,null,null,null,null,5,null,null,5,null,null,null,null,5,null,null,null,null,5]
["ES",2014,"C26","1a",-1,null,null,null,437114,371132,154852,392,3274,4.6100000000000003,282,0,0.01,0.56999999999999995,726.17,295,37.28,473.33,1958.06,9.1199999999999992,372,0.05,5.04,11.99]
["ES",2014,"C26","1b",-1,null,null,null,536504,423459,119177,21,2094,null,21,null,null,null,null,20,null,null,null,null,21]
["ES",2014,"C27",0,-1,null,null,null,9040590,8806770,1980078,507,28724,6.04,369,0,0.1,2.2799999999999998,635.75,417,1.56,435.71,1833.41,7.26,493,0,4.17,9.42]
["ES",2014,"C27",1,-1,null,null,null,1465975,1188773,371510,483,7873,5.73,346,0,0.06,1.77,366.89,393,-42.43,400.65,1625.45,6.51,469,-0.38,4,9.17]
["ES",2014,"C27",2,-1,null,null,null,7574615,7617997,1608568,24,20851,6.08,23,0.56999999999999995,3.68,10.6,707.06,24,333.83,943.3,4446.5200000000004,7.38,24,2.6,8.32,11.14]
["ES",2014,"C27","1a",-1,null,null,null,512773,484066,167009,450,4176,8.74,317,0,0.03,1.27,387.24,363,-71.62,375.61,1357.95,4.28,436,-0.91,3.74,8.9499999999999993]
["ES",2014,"C27","1b",-1,null,null,null,953201,704707,204501,33,3697,4.63,29,null,null,null,359.96,30,null,null,null,8.0399999999999991,33]
["ES",2014,"C28",0,-1,null,null,null,7166840,7143365,2628650,1924,41713,15.63,1601,0,7.0000000000000007E-2,1.72,1550.59,1640,186.17,655.88,3104.64,13.48,1875,2.15,6.1,11.54]
["ES",2014,"C28",1,-1,null,null,null,4526263,3998179,1423902,1900,27058,6.5,1578,0,7.0000000000000007E-2,1.67,811.55,1619,184.72,651.26,3089.14,9.25,1851,2.12,6.01,11.54]
["ES",2014,"C28",2,-1,null,null,null,2640577,3145185,1204748,24,14655,21.33,23,0.02,1.33,3.74,3592.17,21,700.67,1216.44,13869.9,18.850000000000001,24,6.41,8.51,11.19]
["ES",2014,"C28","1a",-1,null,null,null,2462694,2225623,848187,1817,18045,4.22,1500,0,0.05,1.46,726.48,1542,181.94,628.29999999999995,3016.01,8.2899999999999991,1768,2.0499999999999998,5.88,11.21]
["ES",2014,"C28","1b",-1,null,null,null,2063569,1772555,575714,83,9013,8.7799999999999994,78,0.28000000000000003,1.87,8.2200000000000006,918.65,77,394.65,1488.14,4449.04,10.46,83,5.44,11.45,15.57]
["ES",2014,"C29",0,-1,null,null,null,22665008,46042228,6781965,460,92609,6.81,383,0,0.08,1.5,2164.7399999999998,390,185.1,618.92999999999995,3022.33,6.1,451,2.02,5.61,10.72]
["ES",2014,"C29",1,-1,null,null,null,1291876,1386955,455343,412,9504,4.8099999999999996,337,0,0.04,1.19,1190.5,345,154.13999999999999,561.97,2497.71,9.44,403,1.76,5.14,10.81]
["ES",2014,"C29",2,-1,null,null,null,21373132,44655273,6326622,48,83105,6.91,46,0.11,1.1200000000000001,5.38,2254.9299999999998,45,612.34,3024.05,5566.51,6,48,4.74,6.82,10.08]
["ES",2014,"C29","1a",-1,null,null,null,450345,445937,161804,369,4312,9.5,297,0,0.02,0.77,577.66,309,129.88999999999999,489.96,2042.18,7.08,361,1.47,4.47,10.15]
["ES",2014,"C29","1b",-1,null,null,null,841530,941017,293538,43,5192,3.32,40,0.02,1.43,5.79,1795.82,36,634.01,1920.11,5902.63,10.55,42,4.37,7.98,14.52]
["ES",2014,"C30",0,-1,null,null,null,16088053,5621642,1695936,159,24369,44.88,121,0,7.0000000000000007E-2,1.78,248.14,134,139.69999999999999,528.63,2053.77,9.1199999999999992,151,0.89,5.91,12.96]
["ES",2014,"C30",1,-1,null,null,null,437234,369956,150488,144,3101,5.93,109,0,0.04,1.25,798.47,119,141.88,530.85,2009.76,9.02,136,0.86,5.52,11.49]
["ES",2014,"C30",2,-1,null,null,null,15650819,5251686,1545448,15,21268,47.6,12,0.39,5.41,20.86,236.77,15,87.13,517.29,3800.85,9.1199999999999992,15,2.56,11.97,16.239999999999998]
["ES",2014,"C30","1a",-1,null,null,null,186167,119101,60817,132,1452,8.23,99,0,0.03,0.86,667.22,107,132.08000000000001,526.41999999999996,1819.94,9.23,124,0.82,5.03,11.23]
["ES",2014,"C30","1b",-1,null,null,null,251066,250855,89671,12,1648,4.8,10,null,null,null,883.89,12,null,null,null,8.92,12]
["ES",2014,"C31",0,-1,null,null,null,1629832,1241981,400189,1622,13094,13.39,1002,0,0,0.57999999999999996,318.76,1353,-550.49,199.13,890.29,4.1900000000000004,1591,-8.3000000000000007,2.52,7.05]
["ES",2014,"C31",1,-1,null,null,null,1381277,1173101,381188,1621,12753,5.0999999999999996,1001,0,0,0.56999999999999995,342.96,1352,-551.36,199.19,892.25,3.97,1590,-8.31,2.52,7.04]
["ES",2014,"C31",2,-1,null,null,null,null,null,null,1,null,null,1,null,null,null,null,1,null,null,null,null,1]
["ES",2014,"C31","1a",-1,null,null,null,1119439,900501,298722,1608,10892,8.76,988,0,0,0.54,193.74,1340,-560.96,195.26,858.41,2.57,1577,-8.3699999999999992,2.5,6.93]
["ES",2014,"C31","1b",-1,null,null,null,261837,272599,82465,13,1861,1.51,13,null,null,null,1413.11,12,null,null,null,8.6199999999999992,13]
["ES",2014,"C32",0,-1,null,null,null,1227516,1180530,384957,960,8248,6.42,727,0,0,0.48,1359.9,728,114.1,519.29,2232.35,10,931,0.76,4.93,11.48]
["ES",2014,"C32",1,-1,null,null,null,914118,864794,290989,958,7092,3.05,725,0,0,0.47,780.58,726,112.38,506.51,2209.11,7.78,929,0.76,4.93,11.47]
["ES",2014,"C32",2,-1,null,null,null,null,null,null,2,null,null,2,null,null,null,null,2,null,null,null,null,2]
["ES",2014,"C32","1a",-1,null,null,null,654659,567906,209311,944,5830,5.1100000000000003,711,0,0,0.46,598.64,714,107.63,473.95,2199.89,6.83,915,0.64,4.8899999999999997,11.42]
["ES",2014,"C32","1b",-1,null,null,null,259459,296888,81678,14,1262,0.25,14,null,null,null,1331.8,12,null,null,null,9.6,14]
["ES",2014,"C33",0,-1,null,null,null,2933908,2235691,910700,2341,19915,2.46,1733,0,0,0.44,1112.3699999999999,1837,83.48,509.6,2609.5100000000002,8.7200000000000006,2282,0.19,4.1100000000000003,10.050000000000001]
["ES",2014,"C33",1,-1,null,null,null,1591453,1771307,762696,2336,18265,2.65,1728,0,0,0.43,885.12,1835,82.75,508.47,2611.9,7.34,2277,0.19,4.0999999999999996,10.02]
["ES",2014,"C33",2,-1,null,null,null,null,null,null,5,null,null,5,null,null,null,null,2,null,null,null,null,5]
["ES",2014,"C33","1a",-1,null,null,null,1210610,1318401,589995,2312,15342,3.13,1705,0,0,0.41,711.25,1814,76.02,499.79,2598.5300000000002,6.51,2253,0.16,4,9.92]
["ES",2014,"C33","1b",-1,null,null,null,380843,452906,172700,24,2922,1.73,23,0.01,0.51,5.72,1682.58,21,709.84,1140.3399999999999,7727.45,9.77,24,5.23,9.8000000000000007,13.64]
["ES",2014,"D",0,-1,null,null,null,236706607,100676113,15442414,6930,31844,18.579999999999998,6150,0,0,0.23,553.9,5529,184.84,375.1,853.13,15.34,6836,17.36,71.790000000000006,79.7]
["ES",2014,"D",1,-1,null,null,null,12274124,2027276,1108542,6874,2405,2.97,6099,0,0,0.23,275.74,5474,184.5,374.34,846.02,51.68,6780,18.41,71.900000000000006,79.73]
["ES",2014,"D",2,-1,null,null,null,224432483,98648837,14333872,56,29439,19.72,51,-0.52,0.09,4.9400000000000004,597.79,55,248.27,689.32,2893.64,14.59,56,5.57,23.91,68.650000000000006]
["ES",2014,"D","1a",-1,null,null,null,7538308,1204269,670109,6831,2016,4.05,6057,0,0,0.23,278.64999999999998,5434,184.44,374.85,848.02,52.32,6738,17.87,71.959999999999994,79.75]
["ES",2014,"D","1b",-1,null,null,null,4735816,823007,438432,43,389,1.34,42,0.01,0.21,1.81,271.47000000000003,40,188.44,241.39,620.14,50.75,42,58.62,68.06,74.819999999999993]
["ES",2014,"D35",0,-1,null,null,null,236706607,100676113,15442414,6930,31844,18.579999999999998,6150,0,0,0.23,553.9,5529,184.84,375.1,853.13,15.34,6836,17.36,71.790000000000006,79.7]
["ES",2014,"D35",1,-1,null,null,null,12274124,2027276,1108542,6874,2405,2.97,6099,0,0,0.23,275.74,5474,184.5,374.34,846.02,51.68,6780,18.41,71.900000000000006,79.73]
["ES",2014,"D35",2,-1,null,null,null,224432483,98648837,14333872,56,29439,19.72,51,-0.52,0.09,4.9400000000000004,597.79,55,248.27,689.32,2893.64,14.59,56,5.57,23.91,68.650000000000006]
["ES",2014,"D35","1a",-1,null,null,null,7538308,1204269,670109,6831,2016,4.05,6057,0,0,0.23,278.64999999999998,5434,184.44,374.85,848.02,52.32,6738,17.87,71.959999999999994,79.75]
["ES",2014,"D35","1b",-1,null,null,null,4735816,823007,438432,43,389,1.34,42,0.01,0.21,1.81,271.47000000000003,40,188.44,241.39,620.14,50.75,42,58.62,68.06,74.819999999999993]
["ES",2014,"E",0,-1,null,null,null,34270190,9092390,5030219,865,78257,18.09,705,0,0.08,1.93,514.26,699,200.31,801.95,3679.5,29.31,841,2.7,9.09,20.05]
["ES",2014,"E",1,-1,null,null,null,4076019,2065301,890227,833,16176,4.12,674,0,0.06,1.63,694.07,670,195.31,806.75,3840.14,16.2,809,2.5,8.86,19.28]
["ES",2014,"E",2,-1,null,null,null,30194171,7027089,4139992,32,62081,20.100000000000001,31,1.3,5.03,27.57,495.82,29,412.34,772.38,1904.9,33.17,32,11.89,21.16,33.19]
["ES",2014,"E","1a",-1,null,null,null,1239258,740997,291984,774,6877,6.18,616,0,0.03,1.44,643.01,617,180.97,779.27,3817.16,12.08,750,2.25,8.5,18.57]
["ES",2014,"E","1b",-1,null,null,null,2836761,1324303,598242,59,9299,3.37,58,7.0000000000000007E-2,1.0900000000000001,5.29,714.81,53,361.16,1048.79,4900,18.5,59,6.87,16.059999999999999,27.4]
["ES",2014,"E36",0,-1,null,null,null,17675025,4431727,2175296,274,24172,11.81,231,0,0.38,3.37,940.07,201,323.11,1259.26,5242.89,28.5,267,5.09,13.99,25.89]
["ES",2014,"E36",1,-1,null,null,null,2137259,908372,426975,254,6074,2.78,211,0,0.26,3,721.58,184,288.04000000000002,1356.11,6570.66,20.67,247,4.7,13.06,25.56]
["ES",2014,"E36",2,-1,null,null,null,15537766,3523355,1748321,20,18098,13.39,20,1.17,3.69,18.149999999999999,992.53,17,525.44000000000005,901.61,1904.9,30.52,20,14.76,22.18,30.88]
["ES",2014,"E36","1a",-1,null,null,null,546890,209587,92573,222,1714,3.92,180,0,0.15,2.87,992.64,155,220.47,1471.34,7379.66,17.940000000000001,215,3.77,11.06,24.25]
["ES",2014,"E36","1b",-1,null,null,null,1590368,698784,334402,32,4360,2.5,31,7.0000000000000007E-2,0.82,3.55,675.4,29,578.08000000000004,1090.32,3682.36,21.49,32,13.91,17.309999999999999,29.49]
["ES",2014,"E37",0,-1,null,null,null,563912,154053,63999,62,913,26,54,0,0.05,2.04,1030.24,54,195.71,409.05,1621.85,19.600000000000001,61,2.4,7.6,15.28]
["ES",2014,"E37",1,-1,null,null,null,375130,124943,53870,61,751,9.39,53,0,0.05,1.93,1237.53,53,194.64,422.1,1640.09,22.16,60,2.36,7.22,15.74]
["ES",2014,"E37",2,-1,null,null,null,null,null,null,1,null,null,1,null,null,null,null,1,null,null,null,null,1]
["ES",2014,"E37","1a",-1,null,null,null,84367,46887,20662,57,460,23,49,0,0.03,0.39,315.47000000000003,50,183,409.05,1516.63,13.43,56,2.36,6.62,14.74]
["ES",2014,"E37","1b",-1,null,null,null,null,null,null,4,null,null,4,null,null,null,null,3,null,null,null,null,4]
["ES",2014,"E38",0,-1,null,null,null,15826167,4397752,2745548,438,52112,23.82,348,0,0.03,1.41,359.06,372,186.33,719.01,2871.09,30.95,424,1.92,7.95,16.98]
["ES",2014,"E38",1,-1,null,null,null,1358544,923128,364006,427,8291,4.78,338,0,0.03,1.25,599.27,361,188.74,727.02,3056.32,11.73,413,1.8,7.85,16.52]
["ES",2014,"E38",2,-1,null,null,null,14467623,3474624,2381542,11,43821,25.47,10,null,12.99,null,347.03,11,null,412.34,null,36.06,11,null,20.38]
["ES",2014,"E38","1a",-1,null,null,null,526983,419922,151907,406,4009,4.74,317,0,0.02,0.87,513.42999999999995,341,172.98,694.44,2870.14,9.33,392,1.72,7.84,16.39]
["ES",2014,"E38","1b",-1,null,null,null,831560,503205,212099,21,4281,4.8099999999999996,21,null,null,null,661.94,20,null,null,null,13.74,21]
["ES",2014,"E39",0,-1,null,null,null,205085,108857,45373,91,1058,7.27,72,0,0,0.88,577.64,72,127.7,574.41999999999996,3771.06,9.92,89,1.1000000000000001,7.69,13.02]
["ES",2014,"E39",1,-1,null,null,null,205085,108857,45373,91,1058,7.27,72,0,0,0.88,577.64,72,127.7,574.41999999999996,3771.06,9.92,89,1.1000000000000001,7.69,13.02]
["ES",2014,"E39",2,-1,null,null,null,null,null,null,0,null,null,0,null,null,null,null,0,null,null,null,null,0]
["ES",2014,"E39","1a",-1,null,null,null,81016,64599,26840,89,692,11.71,70,0,0,0.86,1267.1600000000001,71,100.16,582.55999999999995,3793.1,10,87,0.92,7.54,12.86]
["ES",2014,"E39","1b",-1,null,null,null,null,null,null,2,null,null,2,null,null,null,null,1,null,null,null,null,2]
["ES",2014,"F",0,-1,null,null,null,82820933,30363029,9453196,33132,211489,33.72,21031,0,0,0.53,217.51,24775,-276.97000000000003,258.92,1449.79,8.2899999999999991,29829,-5,3.47,11.09]
["ES",2014,"F",1,-1,null,null,null,39819935,14430045,5149286,33063,147990,28.45,20974,0,0,0.51,210.8,24706,-281.91000000000003,258.51,1451.96,5.54,29760,-5.04,3.45,11.08]
["ES",2014,"F",2,-1,null,null,null,43000997,15932983,4303910,69,63498,36.17,57,6.92,22.73,51.22,220.78,69,147.55000000000001,371.68,824.75,10.78,69,3.49,7.13,15.25]
["ES",2014,"F","1a",-1,null,null,null,33246651,11461333,4252580,32882,130169,22.09,20808,0,0,0.47,190.8,24534,-290.68,256.12,1445.33,4.79,29581,-5.15,3.43,11.08]
["ES",2014,"F","1b",-1,null,null,null,6573283,2968712,896705,181,17821,42.41,166,1.05,5.64,22.67,273.85000000000002,172,240.78,648.69000000000005,1822.03,8.43,179,2.4900000000000002,5.52,10.59]
["ES",2014,"F41",0,-1,null,null,null,44286729,8701422,1688529,15226,51991,119.57,9007,0,0,1,25.82,11102,-354.35,165.3,1153.18,1.66,12492,-9.02,3.73,18.8]
["ES",2014,"F41",1,-1,null,null,null,27663245,4686559,1368161,15204,43544,54.93,8993,0,0,0.97,89.04,11080,-358.04,165.05,1155.28,5.04,12470,-9.01,3.73,18.850000000000001]
["ES",2014,"F41",2,-1,null,null,null,16623484,4014863,320368,22,8447,null,14,7.62,19.21,55.74,-31.01,22,-33.549999999999997,185.06,630.28,-2.2799999999999998,22,-16.86,3.94,11.33]
["ES",2014,"F41","1a",-1,null,null,null,24389050,3899936,1247018,15150,40932,45.88,8949,0,0,0.93,98.67,11026,-367.31,164.54,1162.31,5.0199999999999996,12418,-9.11,3.73,18.87]
["ES",2014,"F41","1b",-1,null,null,null,3274194,786622,121142,54,2611,98.84,44,2.54,9.24,48.77,60.42,54,67.63,274.89999999999998,739.2,5.13,52,1.1100000000000001,3.29,10.94]
["ES",2014,"F42",0,-1,null,null,null,22995642,10529332,3331406,959,44986,24.47,688,0,0.06,2.68,347.79,751,62.43,386.39,1599.63,12.97,906,0,4.79,11.46]
["ES",2014,"F42",1,-1,null,null,null,2982211,1537459,499293,929,10726,24.31,659,0,0.04,1.87,547.54999999999995,721,29.48,386.24,1639.65,8.6300000000000008,876,-0.16,4.58,10.96]
["ES",2014,"F42",2,-1,null,null,null,20013431,8991873,2832113,30,34259,24.49,29,6.92,32.65,51.22,334.65,30,233.9,415.71,1393.29,13.72,30,4.75,10.06,15.71]
["ES",2014,"F42","1a",-1,null,null,null,1157398,744431,271908,885,7012,11.22,618,0,0.02,1.35,378.99,680,5.1100000000000003,378.42,1618.77,6.17,832,-0.75,4.4400000000000004,10.93]
["ES",2014,"F42","1b",-1,null,null,null,1824812,793028,227384,44,3714,31.25,41,1.97,7.34,27.46,716.25,41,238.84,687.06,1924.73,10.94,44,3.54,6.24,13.86]
["ES",2014,"F43",0,-1,null,null,null,15538569,11132273,4433260,16947,114511,33.94,11336,0,0,0.28999999999999998,492.36,12922,-243.04,344.71,1672.36,9.0399999999999991,16431,-3.29,3.3,8.73]
["ES",2014,"F43",1,-1,null,null,null,9174487,8206026,3281831,16930,93719,15.2,11322,0,0,0.28999999999999998,479.26,12905,-244.28,344.71,1675.62,5.25,16414,-3.31,3.3,8.7200000000000006]
["ES",2014,"F43",2,-1,null,null,null,6364082,2926247,1151429,17,20792,47.95,14,9.0399999999999991,19.690000000000001,41.81,502.64,17,212.61,403.24,561.4,19.670000000000002,17,4.03,7.77,15.57]
["ES",2014,"F43","1a",-1,null,null,null,7700210,6816966,2733653,16847,82224,8.57,11241,0,0,0.26,397.42,12828,-255.61,341.78,1665.17,4.51,16331,-3.39,3.28,8.7200000000000006]
["ES",2014,"F43","1b",-1,null,null,null,1474276,1389060,548177,83,11495,31.78,81,0.4,3.47,9.4499999999999993,987.74,77,446.84,942.31,2530.46,8.86,83,2.69,6.33,10]
["ES",2014,"G",0,-1,null,null,null,164098538,257765036,34569517,64414,825688,24.01,44971,0,0.01,0.97,854.99,48404,-39.950000000000003,357.78,1722.51,5.07,62080,-1.01,2.4500000000000002,6.47]
["ES",2014,"G",1,-1,null,null,null,55723265,77452100,13245489,64076,364399,7.45,44653,0,0.01,0.93,565.83000000000004,48089,-44.98,354.84,1706.47,4,61744,-1.05,2.44,6.47]
["ES",2014,"G",2,-1,null,null,null,108375272,180312935,21324028,338,461288,29.17,318,0.31,2.73,12.19,1016.73,315,417.34,1287.1600000000001,4417.75,5.52,336,1.66,3.88,6.87]
["ES",2014,"G","1a",-1,null,null,null,40432177,50628623,9421808,62659,284884,8.16,43325,0,0.01,0.81,472.64,46803,-68.62,344.17,1666.11,3.7,60327,-1.24,2.41,6.49]
["ES",2014,"G","1b",-1,null,null,null,15291087,26823477,3823681,1417,79514,6.37,1328,0.17,1.44,5.57,810.2,1286,295.51,738.25,3337.93,4.57,1417,1.52,3.25,5.83]
["ES",2014,"G45",0,-1,null,null,null,11090080,19077000,2598628,9063,64101,8.0399999999999991,5800,0,0,0.78,626.36,6960,-320.48,252.71,1128.05,3.12,8817,-3.62,1.79,5.28]
["ES",2014,"G45",1,-1,null,null,null,6806895,9851561,1870371,9021,53073,9.2899999999999991,5760,0,0,0.76,377.65,6918,-327.54000000000002,250.06,1108.71,3.15,8775,-3.72,1.79,5.29]
["ES",2014,"G45",2,-1,null,null,null,4283184,9225438,728256,42,11027,6.68,40,0.15,0.63,3.55,2197.02,42,420.01,1150,3160.28,3.1,42,1.36,2.71,4.49]
["ES",2014,"G45","1a",-1,null,null,null,4578976,5551797,1273190,8787,40400,13.06,5552,0,0,0.6,318.64999999999998,6695,-375.86,240.63,1104.79,2.77,8541,-3.98,1.76,5.33]
["ES",2014,"G45","1b",-1,null,null,null,2227919,4299764,597180,234,12672,5.59,208,0.09,1.59,6.48,461.47,223,218.51,439.31,1313.14,3.64,234,1.1100000000000001,2.39,4.07]
["ES",2014,"G46",0,-1,null,null,null,87044292,143409683,14448358,30559,276310,32.450000000000003,23125,0,0.03,1.41,905.9,23158,125.47,473.77,2395.3200000000002,4.72,29278,0.53,3.09,7.6]
["ES",2014,"G46",1,-1,null,null,null,36138620,49682540,8035894,30352,192765,7.05,22930,0,0.03,1.37,642.85,22967,124.16,468.16,2374.9499999999998,4.46,29072,0.51,3.08,7.61]
["ES",2014,"G46",2,-1,null,null,null,50905671,93727143,6412463,207,83544,44.78,195,0.47,3.72,15.49,1130.52,191,361.53,1125.68,3702.33,4.87,206,1.66,3.96,6.87]
["ES",2014,"G46","1a",-1,null,null,null,24860887,30631919,5362161,29363,141422,7.79,21985,0,0.02,1.23,544.27,22066,117.63,451.78,2319.11,4.26,28083,0.44,3.07,7.68]
["ES",2014,"G46","1b",-1,null,null,null,11277733,19050620,2673733,989,51343,5.98,945,0.15,1.24,5.1100000000000003,869.17,901,315.14,808.62,3746.77,4.7699999999999996,989,1.66,3.47,6.31]
["ES",2014,"G47",0,-1,null,null,null,65964185,95278352,17522531,24792,485276,15.64,16046,0,0,0.5,831.14,18286,-288.93,285.55,1273.4000000000001,5.97,23985,-3.18,1.88,5.64]
["ES",2014,"G47",1,-1,null,null,null,12777767,17917997,3339223,24703,118560,8.01,15963,0,0,0.48,474.52,18204,-293.93,283.17,1257.6500000000001,3.21,23897,-3.22,1.87,5.63]
["ES",2014,"G47",2,-1,null,null,null,53186417,77360354,14183307,89,366716,16.5,83,0.31,2.82,9.65,907.96,82,540.64,2368.21,19901.89,6.61,88,1.99,3.91,7.98]
["ES",2014,"G47","1a",-1,null,null,null,10992333,14444905,2786456,24509,103061,7.51,15788,0,0,0.44,382.63,18042,-305,280,1240.94,2.87,23703,-3.32,1.85,5.63]
["ES",2014,"G47","1b",-1,null,null,null,1785434,3473092,552767,194,15498,9.2899999999999991,175,0.34,2.5299999999999998,6.05,1252.8499999999999,162,280.26,1097.02,5988.83,4.62,194,1.45,3.62,6.32]
["ES",2014,"H",0,-1,null,null,null,158418531,41776393,18685595,10397,270185,7.78,8054,0,0.01,0.76,451.35,8331,150.26,653.14,2250.44,19.66,10064,1.05,6.36,14.46]
["ES",2014,"H",1,-1,null,null,null,18831533,13561583,4709308,10291,100134,3.74,7956,0,0.01,0.71,643.59,8232,148.15,650.95000000000005,2239.86,10.82,9958,1.02,6.35,14.36]
["ES",2014,"H",2,-1,null,null,null,139586998,28214809,13976286,106,170050,8.67,98,0.53,3.8,11.79,423.82,99,258.8,1094.82,4546.4399999999996,23.91,106,3.62,9.1,61.08]
["ES",2014,"H","1a",-1,null,null,null,8774296,8786232,2921295,10036,72099,4.82,7713,0,0.01,0.63,709.02,8017,142.16999999999999,639.78,2202.36,8.6,9704,0.94,6.35,14.3]
["ES",2014,"H","1b",-1,null,null,null,10057236,4775350,1788013,255,28035,2.58,243,0.02,1.0900000000000001,4.99,586.19000000000005,215,399.77,1132.3399999999999,3966.12,14.91,254,3.11,6.87,18.66]
["ES",2014,"H49",0,-1,null,null,null,40664868,18093453,7500469,7443,125208,8.89,5775,0,0.01,0.56000000000000005,462.6,6076,158.01,648.29999999999995,2023.08,15.35,7204,1.34,7,14.46]
["ES",2014,"H49",1,-1,null,null,null,7823080,8334411,2900426,7402,68384,3.25,5737,0,0,0.53,730.64,6037,157.62,647.98,2022.17,8.68,7163,1.32,7,14.48]
["ES",2014,"H49",2,-1,null,null,null,32841787,9759041,4600042,41,56823,10.88,38,0.96,5.01,12.44,409.64,39,304.22000000000003,840.83,1915.3,21.04,41,2.7,6.08,9.7799999999999994]
["ES",2014,"H49","1a",-1,null,null,null,5150682,5892359,2032694,7275,51791,3.22,5620,0,0,0.48,743.72,5928,154.05000000000001,641.72,2005.87,8.4499999999999993,7036,1.24,7.03,14.49]
["ES",2014,"H49","1b",-1,null,null,null,2672397,2442052,867731,127,16593,3.33,117,0.13,1.55,6.52,703.31,109,347.62,766.67,2757.02,9.24,127,2.82,5.74,13.1]
["ES",2014,"H50",0,-1,null,null,null,789749,619978,147607,212,2546,19.22,155,0,0.02,0.66,517.62,155,184.97,842.01,4182.75,9.84,204,0.45,5.68,14.89]
["ES",2014,"H50",1,-1,null,null,null,250507,250265,74369,210,1473,2.92,153,0,0.02,0.61,1531.05,153,184.92,842.01,3908.48,10.4,202,0.3,5.46,14.9]
["ES",2014,"H50",2,-1,null,null,null,null,null,null,2,null,null,2,null,null,null,null,2,null,null,null,null,2]
["ES",2014,"H50","1a",-1,null,null,null,219450,172152,64461,206,1367,3.37,149,0,0.01,0.61,1323.06,150,175.25,833.47,3757.58,12.61,198,-0.01,5.68,14.9]
["ES",2014,"H50","1b",-1,null,null,null,null,null,null,4,null,null,4,null,null,null,null,3,null,null,null,null,4]
["ES",2014,"H51",0,-1,null,null,null,5814534,6507915,1585998,83,21357,368.42,58,0,0.12,3.02,-43.29,61,-174.34,614.22,7070.37,-0.15,79,-5.03,4.53,13.66]
["ES",2014,"H51",1,-1,null,null,null,171716,168209,35356,78,561,14.78,54,0,0.16,3.02,529.99,56,-209.33,527.9,4764.57,5.17,74,-7.39,4.51,12.26]
["ES",2014,"H51",2,-1,null,null,null,null,null,null,5,null,null,4,null,null,null,null,5,null,null,null,null,5]
["ES",2014,"H51","1a",-1,null,null,null,66803,61463,8890,73,227,15.55,49,0,0.01,1.93,473.75,53,-314.32,521.85,6721,4.1900000000000004,69,-8.85,4.5,14.5]
["ES",2014,"H51","1b",-1,null,null,null,null,null,null,5,null,null,5,null,null,null,null,3,null,null,null,null,5]
["ES",2014,"H52",0,-1,null,null,null,108307489,14331151,8064531,2408,63264,7.46,1897,0,0.04,1.74,467.18,1837,142.62,693.22,3401.94,38.56,2331,0.85,4.8600000000000003,15.6]
["ES",2014,"H52",1,-1,null,null,null,10476604,4645449,1649032,2354,27603,4.1100000000000003,1844,0,0.04,1.55,566.16,1788,139.05000000000001,680.44,3188.46,15.16,2277,0.75,4.7300000000000004,14.86]
["ES",2014,"H52",2,-1,null,null,null,97830885,9685701,6415499,54,35661,7.96,53,0.18,3.22,8.65,455.54,49,246.2,1885.07,7973.37,49.78,54,5.0599999999999996,45.74,73.86]
["ES",2014,"H52","1a",-1,null,null,null,3230844,2508923,766983,2236,16641,8.2899999999999991,1728,0,0.03,1.36,632.27,1689,128.66999999999999,653.35,3114.8,9.1199999999999992,2160,0.63,4.5599999999999996,14.18]
["ES",2014,"H52","1b",-1,null,null,null,7245759,2136525,882048,118,10961,2.1,116,0,0.63,3.65,539.04,99,500.05,1201.1099999999999,7676.95,22.26,117,3.55,9.58,36.340000000000003]
["ES",2014,"H53",0,-1,null,null,null,2841901,2223895,1386988,251,57806,null,169,0,0,0.51,-5147.34,202,-164.11,437.37,1702.66,-6.23,246,-1.52,3.18,7.21]
["ES",2014,"H53",1,-1,null,null,null,109636,163247,50123,247,2110,6.47,168,0,0,0.49,392.47,198,-109.65,451.27,1717.24,2.96,242,-1.26,3.21,7.57]
["ES",2014,"H53",2,-1,null,null,null,null,null,null,4,null,null,1,null,null,null,null,4,null,null,null,null,4]
["ES",2014,"H53","1a",-1,null,null,null,106526,151332,48264,246,2070,7.07,167,0,0,0.48,359.52,197,-109.93,448.81,1709.27,2.9,241,-1.27,3.21,7.66]
["ES",2014,"H53","1b",-1,null,null,null,null,null,null,1,null,null,1,null,null,null,null,1,null,null,null,null,1]
["ES",2014,"I",0,-1,null,null,null,23223263,12997469,5907246,15628,199397,17.260000000000002,9938,0,0,0.17,340.57,11414,-282.44,346.27,1636.61,10.09,14929,-3.54,2.7,8.65]
["ES",2014,"I",1,-1,null,null,null,12681711,8772145,3879875,15598,134350,5.66,9912,0,0,0.16,499.95,11385,-287.99,345.05,1635.07,8.93,14899,-3.56,2.68,8.61]
["ES",2014,"I",2,-1,null,null,null,10541551,4225324,2027370,30,65047,34.47,26,0.65,3.51,21.78,231.27,29,100.92,1097.1300000000001,2376.15,12.5,30,4.72,8.89,15.24]
["ES",2014,"I","1a",-1,null,null,null,9739822,7477223,3200241,15523,115568,4.16,9842,0,0,0.15,468.89,11315,-296.89999999999998,341.89,1624.97,7.47,14824,-3.61,2.64,8.5500000000000007]
["ES",2014,"I","1b",-1,null,null,null,2941889,1294921,679633,75,18781,9.39,70,0.19,1.33,7.47,598.42999999999995,70,308.17,955.97,2964.24,17.350000000000001,75,5.52,18.21,26.72]
["ES",2014,"I55",0,-1,null,null,null,16468327,5063828,2516241,3296,64310,19.32,2397,0,0.01,0.63,308.75,2632,26.14,402.73,1776.08,16.02,3108,0.03,8.99,21.56]
["ES",2014,"I55",1,-1,null,null,null,8576330,3195491,1609778,3282,40570,6.3,2387,0,0.01,0.61,526.44000000000005,2619,26.31,403.73,1777.68,17.3,3094,0.04,9,21.58]
["ES",2014,"I55",2,-1,null,null,null,7891996,1868336,906463,14,23739,47.19,10,null,8.19,null,163.75,13,-44.88,100.92,1097.1300000000001,13.82,14,-0.28000000000000003,7.76,15.7]
["ES",2014,"I55","1a",-1,null,null,null,5837395,2307878,1145446,3228,30431,4.1100000000000003,2338,0,0.01,0.56000000000000005,502.7,2567,22.37,387.95,1757.36,15.64,3040,-0.11,8.85,21.24]
["ES",2014,"I55","1b",-1,null,null,null,2738935,887612,464331,54,10139,10.43,49,0.05,1.06,9.75,577.71,52,289.52999999999997,878.94,2858.21,21.64,54,7.31,20.49,30.27]
["ES",2014,"I56",0,-1,null,null,null,6754937,7933641,3391004,12332,135087,13.93,7541,0,0,0.09,408.97,8782,-452.77,331.11,1603.22,6.3,11821,-4.2300000000000004,2.0099999999999998,6.69]
["ES",2014,"I56",1,-1,null,null,null,4105382,5576653,2270097,12316,93779,4.12,7525,0,0,0.09,445.99,8766,-456.84,328.73,1599.01,4.12,11805,-4.25,2,6.69]
["ES",2014,"I56",2,-1,null,null,null,2649555,2356988,1120907,16,41308,22.3,16,0.3,1.4,11.7,381.95,16,921.93,1389.66,11803.17,11.45,16,5.17,9.6300000000000008,14.94]
["ES",2014,"I56","1a",-1,null,null,null,3902428,5169345,2054795,12295,85137,4.26,7504,0,0,0.09,417.54,8748,-459.36,327.27,1591.17,3.82,11784,-4.2699999999999996,1.99,6.68]
["ES",2014,"I56","1b",-1,null,null,null,202953,407308,215302,21,8641,3.25,21,0.39,1.51,7.11,758.35,18,597.34,1238.0899999999999,2881.59,8.02,21,4.91,6.09,10.18]
["ES",2014,"J",0,-1,null,null,null,61848736,45173821,18766899,8502,179591,3.58,5840,0,0,0.5,2382.12,5168,-45.88,648.94000000000005,4088.15,21.17,7987,-1.39,5.6,17.16]
["ES",2014,"J",1,-1,null,null,null,6968026,5920153,2985189,8436,66613,7.93,5785,0,0,0.47,976.89,5105,-54.58,638.84,4015.21,9.4600000000000009,7921,-1.47,5.59,17.12]
["ES",2014,"J",2,-1,null,null,null,54880709,39253668,15781709,66,112978,3.3,55,0.25,3.7,16.96,2616.25,63,456.79,2380.8000000000002,10720.57,22.93,66,2.41,7.2,19.45]
["ES",2014,"J","1a",-1,null,null,null,4377969,3459576,1767645,8307,42693,8.34,5669,0,0,0.41,868.01,4994,-76.040000000000006,622.54,3951.38,8.83,7792,-1.66,5.56,17.2]
["ES",2014,"J","1b",-1,null,null,null,2590057,2460576,1217544,129,23919,7.44,116,0.21,1.7,6.38,1150.2,111,369.5,1602.94,12862.42,10.34,129,2.42,6.49,13.81]
["ES",2014,"J58",0,-1,null,null,null,1758861,1349128,508269,1177,9721,32.67,765,0,0,0.67,600.96,742,-337.54,416.48,3357.64,8.93,1141,-5.97,4.37,14.26]
["ES",2014,"J58",1,-1,null,null,null,1386618,947215,385385,1172,8393,9.61,761,0,0,0.61,348.7,737,-350.38,409.68,3251.86,5.22,1136,-6,4.3499999999999996,14.26]
["ES",2014,"J58",2,-1,null,null,null,null,null,null,5,null,null,4,null,null,null,null,5,null,null,null,null,5]
["ES",2014,"J58","1a",-1,null,null,null,873814,535437,220447,1150,5291,15.04,745,0,0,0.54,689.73,719,-354.39,413.53,3241.94,6.64,1114,-6.16,4.38,14.35]
["ES",2014,"J58","1b",-1,null,null,null,512804,411777,164913,22,3101,-4.29,16,0.5,2.4,6.49,153.61000000000001,18,-102.51,361.64,4031.04,3.37,22,-1.42,2.46,8.98]
["ES",2014,"J59",0,-1,null,null,null,2418428,1906124,296117,966,5905,-10.16,656,0,0,0.39,244.18,600,-97.92,599.66,4668.96,3.04,900,-2.61,7.99,22.29]
["ES",2014,"J59",1,-1,null,null,null,826240,544463,209968,963,3905,6.11,654,0,0,0.37,889.62,597,-99.59,600.44000000000005,4661.3,11.84,897,-2.71,8.01,22.31]
["ES",2014,"J59",2,-1,null,null,null,null,null,null,3,null,null,2,null,null,null,null,3,null,null,null,null,3]
["ES",2014,"J59","1a",-1,null,null,null,578357,349575,137980,951,3007,5.41,642,0,0,0.28999999999999998,1045.24,585,-122.74,583.23,4398.49,12.77,885,-2.94,8.0500000000000007,22.47]
["ES",2014,"J59","1b",-1,null,null,null,247882,194887,71987,12,897,7.69,12,null,null,null,666.29,12,null,null,null,10.18,12]
["ES",2014,"J60",0,-1,null,null,null,2995331,1629070,557525,215,3118,16.39,130,0,0,0.98,2586.86,143,-1372.13,564.91,2589.75,27.23,209,-9.08,4.67,16.809999999999999]
["ES",2014,"J60",1,-1,null,null,null,215558,121170,42330,212,1016,7.49,128,0,0,0.7,3127.85,140,-1414.21,515,2575.29,13.1,206,-9.2899999999999991,4.54,16.73]
["ES",2014,"J60",2,-1,null,null,null,null,null,null,3,null,null,2,null,null,null,null,3,null,null,null,null,3]
["ES",2014,"J60","1a",-1,null,null,null,138366,67094,33954,210,997,10.5,126,0,0,0.65,1511.67,139,-1430.64,465.1,2462,11.41,204,-9.4700000000000006,4.4000000000000004,16.579999999999998]
["ES",2014,"J60","1b",-1,null,null,null,null,null,null,2,null,null,2,null,null,null,null,1,null,null,null,null,2]
["ES",2014,"J61",0,-1,null,null,null,37339603,24242356,10765894,742,48474,-0.32,503,0,0,0.3,4091.78,476,-124.12,684.44,3367.86,31.55,696,-1.54,4.96,15.82]
["ES",2014,"J61",1,-1,null,null,null,768425,798542,317552,722,6156,3.21,485,0,0,0.26,2786.69,457,-206.63,654.45000000000005,3231.95,13.44,676,-2.23,4.79,14.79]
["ES",2014,"J61",2,-1,null,null,null,36571177,23443813,10448342,20,42318,-0.37,18,0.06,0.23,3.19,4119.24,19,880.69,2371.09,9370.01,32.159999999999997,20,7.06,16.5,39.04]
["ES",2014,"J61","1a",-1,null,null,null,330746,327560,144035,701,4222,3.9,465,0,0,0.17,877.97,438,-274.64,603.15,2855.62,7.46,655,-3,4.5999999999999996,14.52]
["ES",2014,"J61","1b",-1,null,null,null,437679,470981,173516,21,1934,3.01,20,null,null,null,7756.95,19,null,null,null,17.600000000000001,21]
["ES",2014,"J62",0,-1,null,null,null,12103592,11941408,5803202,4610,104687,21.27,3242,0,0,0.49,752.48,2776,51.45,702.33,4277.8500000000004,5.15,4308,-0.15,5.63,16.7]
["ES",2014,"J62",1,-1,null,null,null,3270363,3116750,1800615,4577,40465,9.16,3215,0,0,0.45,984.43,2745,48.61,699.46,4220.1400000000003,8.89,4275,-0.18,5.64,16.75]
["ES",2014,"J62",2,-1,null,null,null,8833229,8824658,4002586,33,64221,31.19,27,0.91,4.3,14,630.71,31,199.02,2312.79,15407.25,3.83,33,1.7,5.05,9.86]
["ES",2014,"J62","1a",-1,null,null,null,2054538,1914334,1097517,4513,25843,6.31,3157,0,0,0.41,820.05,2691,39.090000000000003,695.17,4232.91,8.59,4211,-0.25,5.61,16.82]
["ES",2014,"J62","1b",-1,null,null,null,1215824,1202415,703098,64,14622,13.32,58,0.22,1.42,6.74,1392.11,54,369.5,1476.56,3973.68,9.36,64,2.58,6.33,10.92]
["ES",2014,"J63",0,-1,null,null,null,5232925,4105733,835880,792,7684,19.04,544,0,0,0.62,943.44,431,108.74,815.6,5708.49,16.510000000000002,733,-0.69,6.17,22.46]
["ES",2014,"J63",1,-1,null,null,null,500826,392010,229327,790,6675,12.46,542,0,0,0.57999999999999996,1348.21,429,108.69,799.86,5606.75,11.71,731,-0.82,6.11,22.27]
["ES",2014,"J63",2,-1,null,null,null,null,null,null,2,null,null,2,null,null,null,null,2,null,null,null,null,2]
["ES",2014,"J63","1a",-1,null,null,null,402151,265573,133709,782,3330,19.38,534,0,0,0.57999999999999996,1183.67,422,89.91,797.27,4980.09,10.87,723,-0.99,5.94,22.48]
["ES",2014,"J63","1b",-1,null,null,null,98674,126437,95617,8,3344,0.72,8,null,null,null,1764.14,7,null,null,null,13.47,8]
["ES",2014,"K642",0,-1,null,null,null,90764264,87276,81122,467,410,97.51,335,0.33,82.95,101.28,195.77,259,13.25,285.04000000000002,4398.3500000000004,null,295]
["ES",2014,"L",0,-1,null,null,null,91467454,6633206,2349754,22539,33463,34.29,17062,0,0.01,3.21,177.71,15634,82.07,500.8,2485.2800000000002,29.7,17524,5.43,41.5,76.61]
["ES",2014,"L",1,-1,null,null,null,57563196,3574498,2457345,22520,28817,15.37,17051,0,0.01,3.2,396.75,15616,82.51,501.37,2491,51.97,17505,5.46,41.5,76.599999999999994]
["ES",2014,"L",2,-1,null,null,null,33904258,3058708,-107591,19,4646,346.17,11,null,29.17,null,17.59,18,-92.9,181.6,451.24,3.68,19,-64.489999999999995,31.98,80.709999999999994]
["ES",2014,"L","1a",-1,null,null,null,51013660,2929218,2131681,22455,26226,15.53,16994,0,0.01,3.17,429.93,15556,82.86,502.08,2493.77,55.01,17444,5.42,41.49,76.599999999999994]
["ES",2014,"L","1b",-1,null,null,null,6549536,645280,325664,65,2590,14.38,57,0.04,1.56,20.88,263.57,60,51,387.48,1099.73,38.130000000000003,61,13.48,52.43,83.38]
["ES",2014,"L68",0,-1,null,null,null,91467454,6633206,2349754,22539,33463,34.29,17062,0,0.01,3.21,177.71,15634,82.07,500.8,2485.2800000000002,29.7,17524,5.43,41.5,76.61]
["ES",2014,"L68",1,-1,null,null,null,57563196,3574498,2457345,22520,28817,15.37,17051,0,0.01,3.2,396.75,15616,82.51,501.37,2491,51.97,17505,5.46,41.5,76.599999999999994]
["ES",2014,"L68",2,-1,null,null,null,33904258,3058708,-107591,19,4646,346.17,11,null,29.17,null,17.59,18,-92.9,181.6,451.24,3.68,19,-64.489999999999995,31.98,80.709999999999994]
["ES",2014,"L68","1a",-1,null,null,null,51013660,2929218,2131681,22455,26226,15.53,16994,0,0.01,3.17,429.93,15556,82.86,502.08,2493.77,55.01,17444,5.42,41.49,76.599999999999994]
["ES",2014,"L68","1b",-1,null,null,null,6549536,645280,325664,65,2590,14.38,57,0.04,1.56,20.88,263.57,60,51,387.48,1099.73,38.130000000000003,61,13.48,52.43,83.38]
["ES",2014,"M",0,-1,null,null,null,415460825,19292328,10058733,30740,188732,94.91,21962,0,0,1.08,326.64,18835,17,699.32,4454.8999999999996,128.4,28792,-0.1,7.02,21.33]
["ES",2014,"M69",0,-1,null,null,null,6039796,3889822,1929644,10351,42919,26.5,7813,0,0.01,1.3,612.42999999999995,6319,133.08000000000001,810.75,4498.1499999999996,11.49,9973,0.65,6.64,17.48]
["ES",2014,"M69",1,-1,null,null,null,4778716,2691476,1465079,10341,36536,23.1,7803,0,0.01,1.3,1079.69,6309,132.87,810.75,4515.6899999999996,12.12,9963,0.64,6.64,17.489999999999998]
["ES",2014,"M69",2,-1,null,null,null,1261079,1198345,464564,10,6383,35.68,10,null,1.35,null,282.27999999999997,10,null,909.19,null,10.07,10,null,6.66]
["ES",2014,"M69","1a",-1,null,null,null,3901010,2162006,1191686,10308,31884,22.92,7772,0,0.01,1.28,1241.52,6281,131.96,808.27,4489.5600000000004,12.78,9930,0.63,6.64,17.47]
["ES",2014,"M69","1b",-1,null,null,null,877706,529469,273392,33,4651,24.09,31,null,null,null,626.85,28,null,null,null,9.42,33]
["ES",2014,"M70",0,-1,null,null,null,386394862,1685052,2235253,5159,33125,102.26,3618,0,0,7.1,307.51,2958,0,678.79,4887.1000000000004,1338.81,4456,0.12,10.25,36.5]
["ES",2014,"M701",0,-1,null,null,null,381508418,188409,1423185,779,16110,102.88,561,0.27,72,105.97,305.01,499,52.82,571.48,4878.87,null,475]
["ES",2014,"M702",0,-1,null,null,null,4886443,1496642,812067,4380,17015,50.5,3057,0,0,1.51,982.88,2459,-28.14,700.72,4887.45,17.78,3981,-0.01,9.32,32.159999999999997]
["ES",2014,"M702",1,-1,null,null,null,4119529,1109808,581105,4374,11878,47.84,3051,0,0,1.52,934.05,2453,-34.06,699.35,4860.3100000000004,20.12,3975,-0.03,9.32,32.19]
["ES",2014,"M702",2,-1,null,null,null,766914,386834,230962,6,5137,64.39,6,null,0.06,null,1351.66,6,null,5378.26,null,11.06,6,null,1.95]
["ES",2014,"M702","1a",-1,null,null,null,3608961,867961,474732,4359,10743,50.98,3038,0,0,1.49,985.36,2443,-35.82,701.38,4852.8599999999997,21.15,3961,-0.08,9.32,32.1]
["ES",2014,"M702","1b",-1,null,null,null,510568,241847,106373,15,1134,33.299999999999997,13,null,null,null,752.64,10,null,null,null,16.399999999999999,14]
["ES",2014,"M71",0,-1,null,null,null,14477368,7728314,3238881,6149,60906,28.51,4166,0,0,0.69,1145.81,3957,-102.72,566.26,4139.1400000000003,11.72,5812,-3.07,7,22.25]
["ES",2014,"M71",1,-1,null,null,null,4321082,2733726,1404779,6129,30705,17.39,4146,0,0,0.66,860.97,3937,-105.88,565.09,4070.06,10.86,5792,-3.12,6.96,22.3]
["ES",2014,"M71",2,-1,null,null,null,10156285,4994588,1834101,20,30201,33.94,20,4.09,9.0500000000000007,19.57,1366.36,20,464.64,5349.08,8963.34,12.19,20,5.5,8.56,16.07]
["ES",2014,"M71","1a",-1,null,null,null,3059203,1680727,844339,6077,18936,11.05,4104,0,0,0.61,805.63,3893,-109.88,561.75,4032.6,10.3,5740,-3.19,6.93,22.37]
["ES",2014,"M71","1b",-1,null,null,null,1261879,1052999,560440,52,11769,26.25,42,0.14000000000000001,1.94,14.54,952.38,44,239.88,906.82,6655.56,11.77,52,3.51,8.77,17.170000000000002]
["ES",2014,"M72",0,-1,null,null,null,1525921,702828,387184,496,6007,6.15,303,0,0.01,1.08,359.86,309,-556.73,421.87,3025.41,8.1999999999999993,442,-5.89,7.4,27.18]
["ES",2014,"M72",1,-1,null,null,null,1057314,347927,229869,494,4453,9.32,301,0,0.01,1.06,314.01,307,-559.36,421.87,3012.39,9.91,440,-6.11,7.5,27.3]
["ES",2014,"M72",2,-1,null,null,null,null,null,null,2,null,null,2,null,null,null,null,2,null,null,null,null,2]
["ES",2014,"M72","1a",-1,null,null,null,645418,229109,144253,485,3324,70.28,293,0,0.01,1.1100000000000001,65.48,300,-567.67999999999995,421.47,3005.88,1.88,431,-6.73,7.1,26.79]
["ES",2014,"M72","1b",-1,null,null,null,411896,118817,85615,9,1129,null,8,null,null,null,null,7,null,null,null,null,9]
["ES",2014,"M73",0,-1,null,null,null,1889383,2494384,645457,2760,14280,7.96,1949,0,0,0.44,1629.29,1702,12.87,692.89,4503.3999999999996,7.11,2627,-0.7,5.24,16.53]
["ES",2014,"M73",1,-1,null,null,null,1455312,1475166,527648,2756,13771,11.53,1946,0,0,0.43,964.54,1698,12.87,692.03,4474.1099999999997,6.84,2623,-0.7,5.25,16.54]
["ES",2014,"M73",2,-1,null,null,null,null,null,null,4,null,null,3,null,null,null,null,4,null,null,null,null,4]
["ES",2014,"M73","1a",-1,null,null,null,1216671,1046632,402496,2736,10382,12.05,1928,0,0,0.41,864.84,1685,5.44,684.44,4457.3900000000003,7.63,2603,-0.74,5.29,16.739999999999998]
["ES",2014,"M73","1b",-1,null,null,null,238641,428533,125151,20,3389,9.5500000000000007,18,null,null,null,1712.85,13,null,null,null,4.92,20]
["ES",2014,"M74",0,-1,null,null,null,5030841,2667288,1571869,5320,29532,7.15,3755,0,0,0.43,918.87,3217,-12.38,701.98,4805.8500000000004,23.15,4994,-0.53,7.28,23.14]
["ES",2014,"M74",1,-1,null,null,null,4202542,2202108,1195231,5313,26498,11.29,3749,0,0,0.43,894.19,3213,-14.61,699.84,4815.57,17.52,4988,-0.55000000000000004,7.28,23.13]
["ES",2014,"M74",2,-1,null,null,null,828299,465180,376638,7,3034,0.26,6,null,0.68,null,null,4,null,null,null,49.82,6,null,10.94]
["ES",2014,"M74","1a",-1,null,null,null,3228076,1414581,677101,5272,17493,20.69,3713,0,0,0.41,607.73,3183,-19.23,691.9,4740.67,11.97,4948,-0.59,7.26,23.09]
["ES",2014,"M74","1b",-1,null,null,null,974465,787527,518129,41,9004,3.95,36,7.0000000000000007E-2,0.4,3.19,1416.19,30,250.13,1604.8,12659.62,27.49,40,3.62,9.16,39.520000000000003]
["ES",2014,"M75",0,-1,null,null,null,102667,124637,50443,505,1960,2.25,358,0,0,7.0000000000000007E-2,559.58000000000004,373,0,599.27,2470.0100000000002,4.7699999999999996,488,-0.83,4.37,9.7799999999999994]
["ES",2014,"M75",1,-1,null,null,null,102667,124637,50443,505,1960,2.25,358,0,0,7.0000000000000007E-2,559.58000000000004,373,0,599.27,2470.0100000000002,4.7699999999999996,488,-0.83,4.37,9.7799999999999994]
["ES",2014,"M75",2,-1,null,null,null,null,null,null,0,null,null,0,null,null,null,null,0,null,null,null,null,0]
["ES",2014,"M75","1a",-1,null,null,null,102667,124637,50443,505,1960,2.25,358,0,0,7.0000000000000007E-2,559.58000000000004,373,0,599.27,2470.0100000000002,4.7699999999999996,488,-0.83,4.37,9.7799999999999994]
["ES",2014,"M75","1b",-1,null,null,null,null,null,null,0,null,null,0,null,null,null,null,0,null,null,null,null,0]
["ES",2014,"MC",0,-1,null,null,null,33952408,19103918,8635547,29961,172622,23.13,21401,0,0,0.88,903.21,18336,14.88,704.47,4454.3599999999997,12.97,28317,-0.13,6.92,20.74]
["ES",2014,"MC",1,-1,null,null,null,20037152,10684851,5454156,29912,125804,21.28,21354,0,0,0.86,890.43,18290,13.21,701.84,4441.3999999999996,12.85,28269,-0.14000000000000001,6.92,20.75]
["ES",2014,"MC",2,-1,null,null,null,13915256,8419067,3181390,49,46818,25.43,47,0.06,2.71,11.96,919.65,46,463.1,2151,8505.98,13.11,48,4.79,7.82,12.4]
["ES",2014,"MC","1a",-1,null,null,null,15761995,7525656,3785053,29742,94725,25.09,21206,0,0,0.82,833.15,18158,10.48,699.1,4417.6400000000003,11.86,28101,-0.17,6.91,20.74]
["ES",2014,"MC","1b",-1,null,null,null,4275157,3159194,1669103,170,31078,14.23,148,0.08,1.06,12.87,1020.56,132,287.22000000000003,992.87,8383.2999999999993,15.23,168,2.92,8.23,21.45]
["ES",2014,"N",0,-1,null,null,null,23095324,22884003,13166174,10639,495665,14.09,7501,0,0,0.82,660.25,7223,-4.0999999999999996,537.92999999999995,2517.75,8.06,9978,-0.44,5.12,17.39]
["ES",2014,"N",1,-1,null,null,null,11363467,7075076,4050110,10564,154614,20.399999999999999,7434,0,0,0.77,571.72,7153,-8.23,536.95000000000005,2553.54,9.85,9903,-0.51,5.14,17.45]
["ES",2014,"N",2,-1,null,null,null,11731857,15808927,9116063,75,341051,10.26,67,0.46,3.49,13.79,728.67,70,228.67,654.33000000000004,1671.41,7.27,75,1.49,3.65,6.87]
["ES",2014,"N","1a",-1,null,null,null,8001670,4560862,2440363,10433,90709,20.65,7318,0,0,0.71,603.41999999999996,7038,-13.89,533.63,2574.38,9.41,9774,-0.61,5.18,17.489999999999998]
["ES",2014,"N","1b",-1,null,null,null,3361796,2514213,1609747,131,63904,20,116,0.11,1.67,11.79,527.23,115,273.82,695.2,1708.42,10.63,129,1.59,3.99,15.75]
["ES",2014,"N77",0,-1,null,null,null,5439705,1849176,923778,1962,9606,6.79,1371,0,0,0.48,703.77,1476,-19.37,518.44000000000005,2366.6999999999998,35.46,1795,-0.83,13.45,32.950000000000003]
["ES",2014,"N77",1,-1,null,null,null,3231931,1039359,475395,1956,8089,13.5,1365,0,0,0.47,576.4,1470,-20.05,518.44000000000005,2374.81,25.5,1789,-0.91,13.35,32.770000000000003]
["ES",2014,"N77",2,-1,null,null,null,2207774,809817,448383,6,1517,2.23,6,null,0.49,null,827.89,6,null,928.03,null,48.24,6,null,45.36]
["ES",2014,"N77","1a",-1,null,null,null,2093509,786621,350954,1940,7221,5.68,1349,0,0,0.46,533.65,1454,-46.12,513.5,2386.5700000000002,18.61,1773,-1.0900000000000001,13.15,32.299999999999997]
["ES",2014,"N77","1b",-1,null,null,null,1138421,252737,124441,16,867,null,16,null,null,null,null,16,null,null,null,null,16]
["ES",2014,"N78",0,-1,null,null,null,962165,2376717,2206915,308,97527,3.53,234,0,0.03,1.51,1154.1400000000001,200,179.77,574.41,3140.6,3.09,297,0.62,3.78,12.08]
["ES",2014,"N78",1,-1,null,null,null,254110,480753,419796,296,19144,4.34,223,0,0.02,1.1100000000000001,1064.94,188,176.56,538.41,3292.05,4.83,285,0.55000000000000004,4.25,12.49]
["ES",2014,"N78",2,-1,null,null,null,708055,1895964,1787119,12,78383,3.16,11,null,2.0099999999999998,null,1200.57,12,566.27,1801.19,2141.0500000000002,2.65,12,1.42,2.12,3.41]
["ES",2014,"N78","1a",-1,null,null,null,131520,252627,207472,286,8669,2.97,213,0,0.01,1.07,904.33,179,151.19999999999999,531.82000000000005,3337.43,4.82,275,0.36,4.46,12.96]
["ES",2014,"N78","1b",-1,null,null,null,122590,228126,212324,10,10474,5.84,10,null,null,null,1323.71,9,null,null,null,4.8499999999999996,10]
["ES",2014,"N79",0,-1,null,null,null,1715309,5835921,666316,1353,16094,27.79,929,0,0.03,1.79,776.73,903,-87.09,345.96,1643.66,2.78,1270,-0.8,2.04,9.19]
["ES",2014,"N79",1,-1,null,null,null,590914,1309371,226943,1346,5781,6.13,923,0,0.03,1.72,686.61,897,-89.22,345.66,1647.76,3.56,1263,-0.81,2.04,9.17]
["ES",2014,"N79",2,-1,null,null,null,1124395,4526550,439373,7,10313,36.549999999999997,6,null,33.24,null,820.25,6,null,446.03,null,2.5499999999999998,7,null,1.39]
["ES",2014,"N79","1a",-1,null,null,null,442042,852811,154474,1326,4323,9.02,905,0,0.02,1.65,509.61,883,-90.6,341.7,1635.61,2.82,1243,-0.93,2.06,9.27]
["ES",2014,"N79","1b",-1,null,null,null,148872,456560,72469,20,1457,3.05,18,null,null,null,1090.33,14,null,null,null,4.9400000000000004,20]
["ES",2014,"N80",0,-1,null,null,null,1411111,2194652,1669527,446,56909,4.24,339,0,0.02,0.79,654.70000000000005,334,113.47,552.52,2403.34,8.0299999999999994,418,0.94,4.9400000000000004,11.8]
["ES",2014,"N80",1,-1,null,null,null,374971,541888,402500,435,15365,14.3,331,0,0.02,0.71,354.65,324,123.21,570.71,2462.4699999999998,2.98,407,1,4.99,11.84]
["ES",2014,"N80",2,-1,null,null,null,1036140,1652764,1267027,11,41544,3.23,8,null,12.1,null,715.71,10,null,79.31,null,9.69,11,null,0.92]
["ES",2014,"N80","1a",-1,null,null,null,224175,292680,206215,422,7714,6.38,322,0,0.02,0.62,531.30999999999995,312,143.01,582.83000000000004,2578.9499999999998,5.18,394,1.07,5.08,12.13]
["ES",2014,"N80","1b",-1,null,null,null,150795,249208,196285,13,7651,136.75,9,null,null,null,57.69,12,null,null,null,0.39,13]
["ES",2014,"N81",0,-1,null,null,null,5381697,6594773,5294814,2776,235927,13.46,1955,0,0,0.34,609.17999999999995,2021,-44.89,502.63,2107.25,5.42,2699,-0.88,3.58,9.58]
["ES",2014,"N81",1,-1,null,null,null,1552610,1928864,1510175,2756,75239,10.96,1937,0,0,0.28999999999999998,466.44,2001,-54.61,498.16,2131.5700000000002,4.8,2679,-0.91,3.57,9.6]
["ES",2014,"N81",2,-1,null,null,null,3829087,4665909,3784639,20,160688,14.34,18,2.4700000000000002,6.56,15.39,682.24,20,366.55,533.41,1282.07,5.68,20,2.67,4.5,5.75]
["ES",2014,"N81","1a",-1,null,null,null,999548,1243183,929292,2724,44099,6.29,1909,0,0,0.26,533.53,1972,-55.4,498.19,2153.73,4.79,2647,-1.01,3.58,9.67]
["ES",2014,"N81","1b",-1,null,null,null,553062,685680,580882,32,31139,19.37,28,0.72,2.1800000000000002,12.39,380.46,29,269.51,400.52,1249.47,4.83,32,1.5,2.61,5.17]
["ES",2014,"N82",0,-1,null,null,null,8185337,4032762,2404822,3794,79600,26.69,2673,0,0,1.44,572.04999999999995,2289,1.43,685.56,4027.85,10.43,3499,-0.22,7.04,24.41]
["ES",2014,"N82",1,-1,null,null,null,5358930,1774838,1015299,3775,30994,35.58,2655,0,0,1.43,595.46,2273,-1.78,682.56,4035.27,14.25,3480,-0.25,7.07,24.64]
["ES",2014,"N82",2,-1,null,null,null,2826406,2257923,1389522,19,48606,13.25,18,-1.84,0.81,3.3,539.99,16,445.48,930.84,2649.23,7.42,19,2.76,4.87,7.37]
["ES",2014,"N82","1a",-1,null,null,null,4110876,1132937,591954,3735,18680,42.5,2620,0,0,1.33,727.68,2238,-4.13,678.38,3983.42,15.18,3442,-0.3,7.04,24.68]
["ES",2014,"N82","1b",-1,null,null,null,1248054,641900,423345,40,12313,20.87,35,null,null,null,429.59,35,null,null,null,12.61,38]
["ES",2014,"P",0,-1,null,null,null,2523531,2018626,1437055,4619,45275,5.2,3055,0,0,0.16,723.79,2906,-347.28,481.37,2571.1999999999998,9.91,4399,-3.82,4.66,13.49]
["ES",2014,"P",1,-1,null,null,null,2336968,1881062,1366656,4617,43900,5.07,3053,0,0,0.16,777.42,2905,-348.41,481.72,2572.39,10.06,4397,-3.82,4.66,13.5]
["ES",2014,"P",2,-1,null,null,null,null,null,null,2,null,null,2,null,null,null,null,1,null,null,null,null,2]
["ES",2014,"P","1a",-1,null,null,null,1680670,1459004,1052013,4593,35872,5.38,3031,0,0,0.14000000000000001,830.25,2885,-373.64,476.3,2567.64,9.1,4373,-3.92,4.63,13.47]
["ES",2014,"P","1b",-1,null,null,null,656298,422057,314642,24,8027,4.3499999999999996,22,null,null,null,676.18,20,null,null,null,13.37,24]
["ES",2014,"P85",0,-1,null,null,null,2523531,2018626,1437055,4619,45275,5.2,3055,0,0,0.16,723.79,2906,-347.28,481.37,2571.1999999999998,9.91,4399,-3.82,4.66,13.49]
["ES",2014,"P85",1,-1,null,null,null,2336968,1881062,1366656,4617,43900,5.07,3053,0,0,0.16,777.42,2905,-348.41,481.72,2572.39,10.06,4397,-3.82,4.66,13.5]
["ES",2014,"P85",2,-1,null,null,null,null,null,null,2,null,null,2,null,null,null,null,1,null,null,null,null,2]
["ES",2014,"P85","1a",-1,null,null,null,1680670,1459004,1052013,4593,35872,5.38,3031,0,0,0.14000000000000001,830.25,2885,-373.64,476.3,2567.64,9.1,4373,-3.92,4.63,13.47]
["ES",2014,"P85","1b",-1,null,null,null,656298,422057,314642,24,8027,4.3499999999999996,22,null,null,null,676.18,20,null,null,null,13.37,24]
["ES",2014,"Q",0,-1,null,null,null,8521520,6815558,3929423,7511,115096,7.91,5956,0,0,0.32,737.28,5040,222.3,1028.07,4563.25,14.6,7261,2.06,8.57,19.010000000000002]
["ES",2014,"Q",1,-1,null,null,null,5903324,4826026,2711368,7493,83262,10.84,5938,0,0,0.31,887.44,5022,224.39,1030.31,4606.88,13.29,7243,2.0299999999999998,8.56,19]
["ES",2014,"Q",2,-1,null,null,null,2618196,1989532,1218055,18,31834,2.6,18,0.36,1.72,6.96,564.03,18,200.35,729.74,2581.85,17.760000000000002,18,6.98,14.08,20.94]
["ES",2014,"Q","1a",-1,null,null,null,3891829,3238182,1741518,7412,54010,5.0999999999999996,5859,0,0,0.28000000000000003,886.95,4950,217.86,1028.07,4596.87,12.43,7163,1.98,8.51,18.96]
["ES",2014,"Q","1b",-1,null,null,null,2011494,1587843,969849,81,29251,20.5,79,0.17,1.54,5.85,888.28,72,526.97,1239.79,4653.63,15.05,80,7.26,13.32,21.47]
["ES",2014,"Q86",0,-1,null,null,null,6106467,5058890,2614580,6326,58588,8.02,5059,0,0,0.28000000000000003,883.96,4086,267.68,1150.8900000000001,5398.04,15.63,6111,2.2999999999999998,9.0500000000000007,20.11]
["ES",2014,"Q86",1,-1,null,null,null,4000683,3502481,1730152,6312,42697,12.53,5045,0,0,0.27,1220.07,4072,268.23,1154.5,5403.96,13.96,6097,2.29,9.0399999999999991,20.05]
["ES",2014,"Q86",2,-1,null,null,null,2105784,1556409,884428,14,15891,0.72,14,0.14000000000000001,1.72,4.1399999999999997,611.11,14,192.85,887.88,2581.85,19.39,14,6.7,14.74,24.19]
["ES",2014,"Q86","1a",-1,null,null,null,2659605,2354020,1113559,6255,27872,5.35,4990,0,0,0.25,1204.56,4023,263.52999999999997,1143.01,5401.81,13.19,6041,2.2599999999999998,9.01,20.05]
["ES",2014,"Q86","1b",-1,null,null,null,1341077,1148460,616593,57,14825,25.03,55,0.15,1.1000000000000001,5.33,1248.04,49,771.25,1601.77,6108.65,15.54,56,7.72,13.32,20.72]
["ES",2014,"Q87",0,-1,null,null,null,1999929,1375948,1001514,752,40987,7.73,607,0,0.01,0.56999999999999995,449.4,626,178.21,666.74,2408.73,13.02,732,2.2999999999999998,8.23,15.96]
["ES",2014,"Q87",1,-1,null,null,null,1487517,942825,667887,748,25044,5.34,603,0,0.01,0.56000000000000005,479.6,622,177.46,678.91,2408.73,13.52,728,2.29,8.16,15.96]
["ES",2014,"Q87",2,-1,null,null,null,null,null,null,4,null,null,4,null,null,null,null,4,null,null,null,null,4]
["ES",2014,"Q87","1a",-1,null,null,null,1077564,704821,489868,735,19050,3.65,590,0,0.01,0.49,480.42,610,171.4,690.89,2458.96,12.16,715,2.14,7.99,15.72]
["ES",2014,"Q87","1b",-1,null,null,null,409953,238004,178018,13,5994,8.81,13,null,null,null,477.91,12,null,null,null,17.54,13]
["ES",2014,"Q88",0,-1,null,null,null,415124,380719,313327,433,15520,5.66,290,0,0,0.34,444.08,328,-291.11,381.07,1737.97,6.56,418,-2.36,3.36,9.7799999999999994]
["ES",2014,"Q88",1,-1,null,null,null,415124,380719,313327,433,15520,5.66,290,0,0,0.34,444.08,328,-291.11,381.07,1737.97,6.56,418,-2.36,3.36,9.7799999999999994]
["ES",2014,"Q88",2,-1,null,null,null,null,null,null,0,null,null,0,null,null,null,null,0,null,null,null,null,0]
["ES",2014,"Q88","1a",-1,null,null,null,154660,179341,138091,422,7088,12.63,279,0,0,0.14000000000000001,354.34,317,-395.46,350.36,1784.48,3.46,407,-2.52,3.28,9.6999999999999993]
["ES",2014,"Q88","1b",-1,null,null,null,260463,201378,175236,11,8432,3.35,11,null,null,null,484.74,11,null,null,null,9.31,11]
["ES",2014,"R",0,-1,null,null,null,5783749,3420666,1218510,4927,30819,10.210000000000001,3096,0,0,0.28000000000000003,625.89,3296,-345.26,466.67,2921.3,12.07,4561,-6.38,5.83,16.84]
["ES",2014,"R",1,-1,null,null,null,4467329,2746618,938054,4920,26487,7.86,3089,0,0,0.27,620.27,3290,-346.36,466.11,2890.94,10.130000000000001,4554,-6.4,5.82,16.829999999999998]
["ES",2014,"R",2,-1,null,null,null,1316420,674048,280456,7,4332,15.06,7,null,9.89,null,637.84,6,null,4019.71,null,19.97,7,null,18.579999999999998]
["ES",2014,"R","1a",-1,null,null,null,3017603,1879880,702214,4872,21565,7.15,3051,0,0,0.24,585.01,3247,-358.06,463.05,2871.22,10.28,4506,-6.64,5.78,16.829999999999998]
["ES",2014,"R","1b",-1,null,null,null,1449726,866738,235840,48,4921,9.48,38,null,null,null,718.93,43,null,null,null,9.8000000000000007,48]
["ES",2014,"R90",0,-1,null,null,null,325861,264720,89598,880,3002,8.9700000000000006,537,0,0,0.13,686.33,533,-549.04999999999995,506.41,4196.95,6.47,825,-7.37,4.13,15.79]
["ES",2014,"R90",1,-1,null,null,null,325861,264720,89598,880,3002,8.9700000000000006,537,0,0,0.13,686.33,533,-549.04999999999995,506.41,4196.95,6.47,825,-7.37,4.13,15.79]
["ES",2014,"R90",2,-1,null,null,null,null,null,null,0,null,null,0,null,null,null,null,0,null,null,null,null,0]
["ES",2014,"R90","1a",-1,null,null,null,273476,204992,74551,877,2554,10.76,534,0,0,0.13,727.72,530,-563.75,505.06,4234.2,6.62,822,-7.47,4.0999999999999996,15.8]
["ES",2014,"R90","1b",-1,null,null,null,null,null,null,3,null,null,3,null,null,null,null,3,null,null,null,null,3]
["ES",2014,"R91",0,-1,null,null,null,79012,35930,19861,116,618,3.38,67,0,0,0.15,315.55,77,-868.98,170.09,1007.83,13.26,114,-11.64,3.21,14.14]
["ES",2014,"R91",1,-1,null,null,null,79012,35930,19861,116,618,3.38,67,0,0,0.15,315.55,77,-868.98,170.09,1007.83,13.26,114,-11.64,3.21,14.14]
["ES",2014,"R91",2,-1,null,null,null,null,null,null,0,null,null,0,null,null,null,null,0,null,null,null,null,0]
["ES",2014,"R91","1a",-1,null,null,null,79012,35930,19861,116,618,3.38,67,0,0,0.15,315.55,77,-868.98,170.09,1007.83,13.26,114,-11.64,3.21,14.14]
["ES",2014,"R91","1b",-1,null,null,null,null,null,null,0,null,null,0,null,null,null,null,0,null,null,null,null,0]
["ES",2014,"R92",0,-1,null,null,null,1878429,1739617,477736,1383,9390,10.42,1094,0,0,0.66,1169.24,1001,264.27999999999997,1219.45,6183.81,12.68,1263,3.52,10.65,21.41]
["ES",2014,"R92",1,-1,null,null,null,1528906,1431693,396206,1379,8079,8.4499999999999993,1090,0,0,0.64,1052.4000000000001,998,263.91000000000003,1218.79,6183.03,12.42,1259,3.44,10.55,21.41]
["ES",2014,"R92",2,-1,null,null,null,null,null,null,4,null,null,4,null,null,null,null,3,null,null,null,null,4]
["ES",2014,"R92","1a",-1,null,null,null,986428,865883,252865,1348,5608,6.46,1064,0,0,0.53,939.43,970,263.91000000000003,1207.44,6183.03,12.3,1228,3.46,10.48,21.37]
["ES",2014,"R92","1b",-1,null,null,null,542478,565809,143341,31,2471,11.42,26,0.41,2.56,14.54,1282.82,28,355.46,1626.01,6560.48,12.6,31,3.58,12.39,24.24]
["ES",2014,"R93",0,-1,null,null,null,3500446,1380397,631313,2548,17807,10.24,1398,0,0,0.16,395.3,1685,-840.86,192.51,1470.94,12.34,2359,-13.18,3.02,13.67]
["ES",2014,"R93",1,-1,null,null,null,2533549,1014273,432387,2545,14786,6.56,1395,0,0,0.16,327.77,1682,-852,192.11,1464.31,7.74,2356,-13.2,3.02,13.63]
["ES",2014,"R93",2,-1,null,null,null,null,null,null,3,null,null,3,null,null,null,null,3,null,null,null,null,3]
["ES",2014,"R93","1a",-1,null,null,null,1678686,773072,354936,2531,12784,7.77,1386,0,0,0.15,373.49,1670,-857.62,192.11,1464.31,8.86,2342,-13.21,3.01,13.61]
["ES",2014,"R93","1b",-1,null,null,null,854863,241200,77451,14,2002,null,9,null,null,null,null,12,null,null,null,null,14]
["ES",2014,"S",0,-1,null,null,null,2877826,2124743,1062862,5268,37149,13.67,2941,0,0,0.13,800.88,3550,-1145.5999999999999,255.34,1491.55,9.4499999999999993,5049,-13.55,1.93,10.7]
["ES",2014,"S",1,-1,null,null,null,2508326,1694793,895111,5265,32905,15.3,2938,0,0,0.13,757.93,3547,-1150.4000000000001,255.11,1489.7,10.32,5046,-13.55,1.93,10.69]
["ES",2014,"S",2,-1,null,null,null,null,null,null,3,null,null,3,null,null,null,null,3,null,null,null,null,3]
["ES",2014,"S","1a",-1,null,null,null,2029034,1358737,721673,5251,29013,14.34,2924,0,0,0.13,726.38,3535,-1159.5999999999999,250.44,1480.05,9.26,5032,-13.63,1.91,10.65]
["ES",2014,"S","1b",-1,null,null,null,479292,336055,173437,14,3892,17.75,14,null,null,null,853.03,12,null,null,null,14.6,14]
["ES",2014,"S94",0,-1,null,null,null,null,null,null,0,null,null,0,null,null,null,null,0,null,null,null,null,0]
["ES",2014,"S94",1,-1,null,null,null,null,null,null,0,null,null,0,null,null,null,null,0,null,null,null,null,0]
["ES",2014,"S94",2,-1,null,null,null,null,null,null,0,null,null,0,null,null,null,null,0,null,null,null,null,0]
["ES",2014,"S94","1a",-1,null,null,null,null,null,null,0,null,null,0,null,null,null,null,0,null,null,null,null,0]
["ES",2014,"S94","1b",-1,null,null,null,null,null,null,0,null,null,0,null,null,null,null,0,null,null,null,null,0]
["ES",2014,"S95",0,-1,null,null,null,408329,653304,249114,733,6365,9.18,466,0,0,0.12,898.62,511,-546.99,367.4,1965.99,2.78,717,-5.38,2.44,6.82]
["ES",2014,"S95",1,-1,null,null,null,235662,350519,154220,732,4733,11.73,465,0,0,0.11,687.15,510,-557.12,367.27,1951.72,3.82,716,-5.39,2.44,6.84]
["ES",2014,"S95",2,-1,null,null,null,null,null,null,1,null,null,1,null,null,null,null,1,null,null,null,null,1]
["ES",2014,"S95","1a",-1,null,null,null,173122,226993,94328,728,3015,3.92,461,0,0,0.11,661.48,506,-571.04999999999995,361.89,1948.54,4.7300000000000004,712,-5.46,2.4,6.92]
["ES",2014,"S95","1b",-1,null,null,null,null,null,null,4,null,null,4,null,null,null,null,4,null,null,null,null,4]
["ES",2014,"S96",0,-1,null,null,null,2469496,1471438,813747,4535,30783,14.12,2475,0,0,0.13,792.33,3039,-1282.21,234.76,1381.15,12.42,4332,-15.4,1.79,11.3]
["ES",2014,"S96",1,-1,null,null,null,2272663,1344273,740890,4533,28171,15.59,2473,0,0,0.13,764.46,3037,-1284.0899999999999,234.62,1380.58,12.02,4330,-15.4,1.77,11.26]
["ES",2014,"S96",2,-1,null,null,null,null,null,null,2,null,null,2,null,null,null,null,2,null,null,null,null,2]
["ES",2014,"S96","1a",-1,null,null,null,1855912,1131744,627345,4523,25997,15.32,2463,0,0,0.13,733.09,3029,-1289.69,232.13,1378.14,10.17,4320,-15.49,1.76,11.18]
["ES",2014,"S96","1b",-1,null,null,null,416751,212528,113545,10,2174,16.28,10,null,null,null,855.27,8,null,null,null,21.84,10]
["ES",2014,"Z0",0,-1,null,null,null,1541977750,809095691,184896652,264701,3459798,35.99,187443,0,0,0.76,500.25,192366,-2.83,434.06,2104.4899999999998,12.46,247522,-0.61,4.51,14.71]
["ES",2014,"ZC",0,-1,null,null,null,1160469331,808907281,183473467,263922,3443688,16.989999999999998,186882,0,0,0.74,611.37,191867,-3.08,433.65,2100,9.7100000000000009,247047,-0.61,4.5,14.65]
["ES",2014,"ZC",1,-1,null,null,null,317899331,210064766,65774078,262541,1705652,10.39,185611,0,0,0.71,528.12,190561,-6.66,430.58,2083.09,8.44,245669,-0.66,4.49,14.65]
["ES",2014,"ZC",2,-1,null,null,null,842570001,598842515,117699388,1381,1738035,18.920000000000002,1271,0.28999999999999998,2.52,13.93,640.84,1306,349.61,1133.3399999999999,4857.96,10.15,1378,2.81,6.85,14.27]
["ES",2014,"ZC","1a",-1,null,null,null,229641133,136212098,44951601,258709,1278927,10.68,182036,0,0,0.64,478.19,187084,-17.78,422.46,2057.12,7.88,241852,-0.82,4.46,14.72]
["ES",2014,"ZC","1b",-1,null,null,null,88258204,73852667,20822477,3832,426724,9.94,3575,0.13,1.39,6.04,628.92999999999995,3477,315.20999999999998,848.08,3677.23,9.4700000000000006,3817,2.38,5.53,11.86]

{"sheet":"EBITDA calculation","index":3,"n_rows":61,"n_cols":6,"rows_kept":61,"cut":false,"hidden":false,"merged":[[4,1,4,5],[6,1,6,5],[61,0,61,6],[7,3,7,5],[8,3,8,5],[9,3,9,5],[60,1,60,6]]}
[]
[]
[]
[]
[null,"Calculation of EBITDA (AECA definition) and related ratios"]
[]
[null,"Identification"]
[null,"Name of firm",null,{"$f":"IF('Data upload'!E7=\"\",\"\",'Data upload'!E7)","v":""}]
[null,"Tax identification number",null,{"$f":"IF('Data upload'!E8=\"\",\"\",'Data upload'!E8)","v":""}]
[null,"NACE",null,{"$f":"IF('Data upload'!E9=\"\",\"\",'Data upload'!E9)","v":""}]
[null,"YEAR",null,null,null,{"$f":"IF('Data upload'!E10=\"\",\"\",'Data upload'!E10)","v":"N"}]
[null,"EBITDA. AECA definition. Calculation method",null,null,null,{"$f":"+'Data upload'!H11","v":"Amount (units)"}]
[]
[null,"Code","Item",null,{"$f":"+'Data upload'!E12","v":"N-1"},{"$f":"+'Data upload'!G12","v":"N"}]
[null,49500,"1. Net profit or loss for the year",null,{"$f":"'Data upload'!E28","v":0},{"$f":"'Data upload'!G28","v":0}]
[]
[null,null,"2. Adjustments to profit/loss",null,{"$f":"IF(ISERROR(E19+E20+E21+E22+E23+E24+E25+E26+E27+E28+E29+E30+E31),\"\",E19+E20+E21+E22+E23+E24+E25+E26+E27+E28+E29+E30+E31)","v":0},{"$f":"IF(ISERROR(F19+F20+F21+F22+F23+F24+F25+F26+F27+F28+F29+F30+F31),\"\",F19+F20+F21+F22+F23+F24+F25+F26+F27+F28+F29+F30+F31)","v":0}]
[]
[null,42000,"- Profit/loss from discontinued operations net of tax (1)",null,{"$f":"-'Data upload'!E27","v":0},{"$f":"-'Data upload'!G27","v":0}]
[null,41900,"- Tax on profit",null,{"$f":"-'Data upload'!E25","v":0},{"$f":"-'Data upload'!G25","v":0}]
[null,41400,"- Financial income",null,{"$f":"-'Data upload'!E19","v":0},{"$f":"-'Data upload'!G19","v":0}]
[null,41500,"- Financial expenses",null,{"$f":"-'Data upload'!E20","v":0},{"$f":"-'Data upload'!G20","v":0}]
[null,41600,"- Gain/loss in changes in fair value of financial instruments",null,{"$f":"-'Data upload'!E21","v":0},{"$f":"-'Data upload'!G21","v":0}]
[null,41700,"- Exchange differences ",null,{"$f":"-'Data upload'!E22","v":0},{"$f":"-'Data upload'!G22","v":0}]
[null,41100,"- Impairment and gain/loss on intangible and tangible fixed assets",null,{"$f":"-'Data upload'!E16","v":0},{"$f":"-'Data upload'!G16","v":0}]
[null,41800,"- Impairment and gain/loss on financial instruments",null,{"$f":"-'Data upload'!E23","v":0},{"$f":"-'Data upload'!G23","v":0}]
[null,42100,"- Other financial income/expenses",null,{"$f":"-'Data upload'!E24","v":0},{"$f":"-'Data upload'!G24","v":0}]
[null,40800,"- Depreciation and amortization of intangible and tangible fixed assets",null,{"$f":"-'Data upload'!E14","v":0},{"$f":"-'Data upload'!G14","v":0}]
[null,40900,"- Government grants of non-financial assets recognised as income during the year",null,{"$f":"-'Data upload'!E15","v":0},{"$f":"-'Data upload'!G15","v":0}]
[null,41300,"- Other gains/losses",null,{"$f":"-'Data upload'!E18","v":0},{"$f":"-'Data upload'!G18","v":0}]
[null,41200,"- Negative goodwill resulting from business combinations (1)",null,{"$f":"-'Data upload'!E17","v":0},{"$f":"-'Data upload'!G17","v":0}]
[]
[null,null,"3. Other adjustments included by the firm (according to OE number 4/2016 AECA)",null,{"$f":"+E35+E36","v":0},{"$f":"+F35+F36","v":0}]
[]
[null,null,"- Income (-) (other non-recurring income)"]
[null,null,"- Expenses (+) (other non-recurring expenses)"]
[]
[null,"EBITDA (AECA definition) (1+2+3)",null,null,{"$f":"IF(ISERROR(E15+E17+E35+E36),\"\",E15+E17+E35+E36)","v":0},{"$f":"IF(ISERROR(F15+F17+F35+F36),\"\",F15+F17+F35+F36)","v":0}]
[]
[]
[null,"Calculation of related ratios (percentages)"]
[]
[null,"Ratio","Definition",null,{"$f":"+E14","v":"N-1"},{"$f":"+F14","v":"N"}]
[null,"R33","EBITDA / Net turnover",null,{"$f":"IF(ISERROR(E38/'Data upload'!E13*100),\"\",IF('Data upload'!E13<0,\"\",E38/'Data upload'!E13*100))","v":""},{"$f":"IF(ISERROR(F38/'Data upload'!G13*100),\"\",IF('Data upload'!G13<0,\"\",F38/'Data upload'!G13*100))","v":""}]
[null,"R22","EBITDA / Financial expenses",null,{"$f":"IF(ISERROR(E38/E22*100),\"\",IF(E22<0,\"\",E38/E22*100))","v":""},{"$f":"IF(ISERROR(F38/F22*100),\"\",IF(F22<0,\"\",F38/F22*100))","v":""}]
[null,"R21","Financial income / EBITDA",null,{"$f":"IF(ISERROR(-(E21)/E38*100),\"\",IF(E38<0,\"\",-(E21)/E38*100))","v":""},{"$f":"IF(ISERROR(-(F21)/F38*100),\"\",IF(F38<0,\"\",-(F21)/F38*100))","v":""}]
[]
[]
[]
[]
[]
[]
[]
[]
[]
[]
[]
[]
[]
[]
[null,"(1) Item to be used in separate financial statements only."]

{"sheet":"Report","index":4,"n_rows":38,"n_cols":56,"rows_kept":38,"cut":false,"hidden":false,"merged":[[10,15,10,20],[3,37,3,48],[3,17,3,26],[7,1,8,2],[3,27,3,36],[3,3,3,16],[7,6,8,6],[1,1,1,48],[2,17,2,26],[2,27,2,36],[2,37,2,48],[2,1,2,16],[12,1,12,2],[4,17,4,26],[13,25,13,30],[16,15,16,20],[19,25,19,30],[5,3,5,16],[10,25,10,30],[13,15,13,20],[16,25,16,30],[4,1,4,16],[7,7,7,48],[4,27,4,36],[4,37,4,48],[5,1,5,2],[10,35,10,40],[16,35,16,40],[38,0,38,49],[24,1,24,2],[22,25,22,30],[13,35,13,40],[37,1,37,4],[19,35,19,40],[36,1,36,4],[22,35,22,40],[25,15,25,20],[25,25,25,30],[25,35,25,40],[19,15,19,20],[22,15,22,20]]}
[]
[null,"EBITDA (AECA definition) - Firm / sector of activity comparison"]
[null,"Firm",null,null,null,null,null,null,null,null,null,null,null,null,null,null,null,"National identification code",null,null,null,null,null,null,null,null,null,"NACE"]
[null,"Name of firm",null,null,null,null,null,null,null,null,null,null,null,null,null,null,null,{"$f":"IF('Data upload'!E8=\"\",\"\",'Data upload'!E8)","v":""},null,null,null,null,null,null,null,null,null,{"$f":"IF('Data upload'!E9=\"\",\"\",'Data upload'!E9)","v":""}]
[null,"Sector",null,null,null,null,null,null,null,null,null,null,null,null,null,null,null,"Size"]
[null,"Aggregate",null,{"$f":"+'Data upload'!K91","v":""},null,null,null,null,null,null,null,null,null,null,null,null,null,{"$f":"IF('Data upload'!K92=\"\",\"\",'Data upload'!K92)","v":"SMEs : turnover < 50 M€"}]
[]
[null,"Ratio (%)",null,null,"Year","Firm value",null,"Position in the sector"]
[null,null,null,null,null,null,null,{"$f":"IF(ISERROR(TEXT('Data upload'!K90,\"####\")),\"\",TEXT('Data upload'!K90,\"####\"))","v":""},null,null,null,null,null,null,null,null,null,null,null,null,null,null,null,null,null,null,null,null,null,null,null,null,null,null,null,null,null,null,null,null,null,null,null,null,null,null,null,null,null,null,"LÍMITE\nINFERIOR","LÍMITE\nSUPERIOR","GAJO 1","GAJO 2","GAJO 3","GAJO 4"]
[null,"     R33. EBITDA / Net turnover",null,null,{"$f":"+'Data upload'!G12","v":"N"},{"$f":"IF(COUNTBLANK('Data upload'!F44:H44)+COUNTIF('Data upload'!F44:H44,\"-\")+COUNTBLANK('Data upload'!F47:H47)+COUNTIF('Data upload'!F47:H47,\"-\")+COUNTBLANK('Data upload'!F50:H50)+COUNTIF('Data upload'!F50:H50,\"-\")>=1,\"Sector not valid, select another comparative aggregate\",IF(OR('EBITDA calculation'!F44=\"\",ISERROR('EBITDA calculation'!F44)),\"Not evaluable ratio\",'EBITDA calculation'!F44))","v":"Sector not valid, select another comparative aggregate"},null,{"$f":"IF(F10<AY10,\"0\",\"\")","v":{"$error":"#VALUE!"}},{"$f":"IF(F10=\"\",\"\",IF(AND(F10>=AY10,F10<(AY10+BA10)),\"0\",\"\"))","v":{"$error":"#VALUE!"}},{"$f":"IF(F10=\"\",\"\",IF(AND(F10>=AY10+BA10,F10<(AY10+(BA10*2))),\"0\",\"\"))","v":{"$error":"#VALUE!"}},{"$f":"IF(F10=\"\",\"\",IF(AND(F10>=AY10+(BA10*2),F10<(AY10+(BA10*3))),\"0\",\"\"))","v":{"$error":"#VALUE!"}},{"$f":"IF(F10=\"\",\"\",IF(AND(F10>=AY10+(BA10*3),F10<(AY10+(BA10*4))),\"0\",\"\"))","v":{"$error":"#VALUE!"}},{"$f":"IF(F10=\"\",\"\",IF(AND(F10>=AY10+(BA10*4),F10<(AY10+(BA10*5))),\"0\",\"\"))","v":{"$error":"#VALUE!"}},{"$f":"IF(F10=\"\",\"\",IF(AND(F10>=AY10+(BA10*5),F10<(AY10+(BA10*6))),\"0\",\"\"))","v":{"$error":"#VALUE!"}},{"$f":"IF(F10=\"\",\"\",IF(AND(F10>=AY10+(BA10*6),F10<(AY10+(BA10*7))),\"0\",\"\"))","v":{"$error":"#VALUE!"}},{"$f":"IF(F10=\"\",\"\",IF(AND(F10>=AY10+(BA10*7),F10<(AY10+(BA10*8))),\"0\",\"\"))","v":{"$error":"#VALUE!"}},{"$f":"IF(F10=\"\",\"\",IF(AND(F10>=AY10+(BA10*8),F10<(AY10+(BA10*9))),\"0\",\"\"))","v":{"$error":"#VALUE!"}},{"$f":"IF(F10=\"\",\"\",IF(AND(F10>=AY10+(BA10*9),F10<('Data upload'!F44)),\"0\",\"\"))","v":{"$error":"#VALUE!"}},{"$f":"IF(F10=\"\",\"\",IF(AND(F10>='Data upload'!F44,F10<('Data upload'!F44+BB10)),\"0\",\"\"))","v":{"$error":"#VALUE!"}},{"$f":"IF(F10=\"\",\"\",IF(AND(F10>=('Data upload'!F44+BB10),F10<('Data upload'!F44+(BB10*2))),\"0\",\"\"))","v":{"$error":"#VALUE!"}},{"$f":"IF(F10=\"\",\"\",IF(AND(F10>=('Data upload'!F44+(BB10*2)),F10<('Data upload'!F44+(BB10*3))),\"0\",\"\"))","v":{"$error":"#VALUE!"}},{"$f":"IF(F10=\"\",\"\",IF(AND(F10>=('Data upload'!F44+(BB10*3)),F10<('Data upload'!F44+(BB10*4))),\"0\",\"\"))","v":{"$error":"#VALUE!"}},{"$f":"IF(F10=\"\",\"\",IF(AND(F10>=('Data upload'!F44+(BB10*4)),F10<('Data upload'!F44+(BB10*5))),\"0\",\"\"))","v":{"$error":"#VALUE!"}},{"$f":"IF(F10=\"\",\"\",IF(AND(F10>=('Data upload'!F44+(BB10*5)),F10<('Data upload'!F44+(BB10*6))),\"0\",\"\"))","v":{"$error":"#VALUE!"}},{"$f":"IF(F10=\"\",\"\",IF(AND(F10>=('Data upload'!F44+(BB10*6)),F10<('Data upload'!F44+(BB10*7))),\"0\",\"\"))","v":{"$error":"#VALUE!"}},{"$f":"IF(F10=\"\",\"\",IF(AND(F10>=('Data upload'!F44+(BB10*7)),F10<('Data upload'!F44+(BB10*8))),\"0\",\"\"))","v":{"$error":"#VALUE!"}},{"$f":"IF(F10=\"\",\"\",IF(AND(F10>=('Data upload'!F44+(BB10*8)),F10<('Data upload'!F44+(BB10*9))),\"0\",\"\"))","v":{"$error":"#VALUE!"}},{"$f":"IF(F10=\"\",\"\",IF(AND(F10>=('Data upload'!F44+(BB10*9)),F10<('Data upload'!G44)),\"0\",\"\"))","v":{"$error":"#VALUE!"}},{"$f":"IF(F10=\"\",\"\",IF(AND(F10>='Data upload'!G44,F10<('Data upload'!G44+BC10)),\"0\",\"\"))","v":{"$error":"#VALUE!"}},{"$f":"IF(F10=\"\",\"\",IF(AND(F10>=('Data upload'!G44+BC10),F10<('Data upload'!G44+(BC10*2))),\"0\",\"\"))","v":{"$error":"#VALUE!"}},{"$f":"IF(F10=\"\",\"\",IF(AND(F10>=('Data upload'!G44+(BC10*2)),F10<('Data upload'!G44+(BC10*3))),\"0\",\"\"))","v":{"$error":"#VALUE!"}},{"$f":"IF(F10=\"\",\"\",IF(AND(F10>=('Data upload'!G44+(BC10*3)),F10<('Data upload'!G44+(BC10*4))),\"0\",\"\"))","v":{"$error":"#VALUE!"}},{"$f":"IF(F10=\"\",\"\",IF(AND(F10>=('Data upload'!G44+(BC10*4)),F10<('Data upload'!G44+(BC10*5))),\"0\",\"\"))","v":{"$error":"#VALUE!"}},{"$f":"IF(F10=\"\",\"\",IF(AND(F10>=('Data upload'!G44+(BC10*5)),F10<('Data upload'!G44+(BC10*6))),\"0\",\"\"))","v":{"$error":"#VALUE!"}},{"$f":"IF(F10=\"\",\"\",IF(AND(F10>=('Data upload'!G44+(BC10*6)),F10<('Data upload'!G44+(BC10*7))),\"0\",\"\"))","v":{"$error":"#VALUE!"}},{"$f":"IF(F10=\"\",\"\",IF(AND(F10>=('Data upload'!G44+(BC10*7)),F10<('Data upload'!G44+(BC10*8))),\"0\",\"\"))","v":{"$error":"#VALUE!"}},{"$f":"IF(F10=\"\",\"\",IF(AND(F10>=('Data upload'!G44+(BC10*8)),F10<('Data upload'!G44+(BC10*9))),\"0\",\"\"))","v":{"$error":"#VALUE!"}},{"$f":"IF(F10=\"\",\"\",IF(AND(F10>=('Data upload'!G44+(BC10*9)),F10<('Data upload'!H44)),\"0\",\"\"))","v":{"$error":"#VALUE!"}},{"$f":"IF(F10=\"\",\"\",IF(AND(F10>='Data upload'!H44,F10<('Data upload'!H44+BD10)),\"0\",\"\"))","v":{"$error":"#VALUE!"}},{"$f":"IF(F10=\"\",\"\",IF(AND(F10>=('Data upload'!H44+BD10),F10<('Data upload'!H44+(BD10*2))),\"0\",\"\"))","v":{"$error":"#VALUE!"}},{"$f":"IF(F10=\"\",\"\",IF(AND(F10>=('Data upload'!H44+(BD10*2)),F10<('Data upload'!H44+(BD10*3))),\"0\",\"\"))","v":{"$error":"#VALUE!"}},{"$f":"IF(F10=\"\",\"\",IF(AND(F10>=('Data upload'!H44+(BD10*3)),F10<('Data upload'!H44+(BD10*4))),\"0\",\"\"))","v":{"$error":"#VALUE!"}},{"$f":"IF(F10=\"\",\"\",IF(AND(F10>=('Data upload'!H44+(BD10*4)),F10<('Data upload'!H44+(BD10*5))),\"0\",\"\"))","v":{"$error":"#VALUE!"}},{"$f":"IF(F10=\"\",\"\",IF(AND(F10>=('Data upload'!H44+(BD10*5)),F10<('Data upload'!H44+(BD10*6))),\"0\",\"\"))","v":{"$error":"#VALUE!"}},{"$f":"IF(F10=\"\",\"\",IF(AND(F10>=('Data upload'!H44+(BD10*6)),F10<('Data upload'!H44+(BD10*7))),\"0\",\"\"))","v":{"$error":"#VALUE!"}},{"$f":"IF(F10=\"\",\"\",IF(AND(F10>=('Data upload'!H44+(BD10*7)),F10<('Data upload'!H44+(BD10*8))),\"0\",\"\"))","v":{"$error":"#VALUE!"}},{"$f":"IF(F10=\"\",\"\",IF(AND(F10>=('Data upload'!H44+(BD10*8)),F10<('Data upload'!H44+(BD10*9))),\"0\",\"\"))","v":{"$error":"#VALUE!"}},{"$f":"IF(F10=\"\",\"\",IF(AND(F10>=('Data upload'!H44+(BD10*9)),F10<(AZ10)),\"0\",\"\"))","v":{"$error":"#VALUE!"}},{"$f":"IF(OR(F10=\"Not evaluable ratio\",F10=\"Sector no válido, seleccione otro agregado de comparación\"),\"\",IF(F10>=AZ10,\"0\",\"\"))","v":{"$error":"#VALUE!"}},null,{"$f":"+'Data upload'!F44-('Data upload'!G44-'Data upload'!F44)","v":{"$error":"#VALUE!"}},{"$f":"+'Data upload'!H44+('Data upload'!H44-'Data upload'!G44)","v":{"$error":"#VALUE!"}},{"$f":"+('Data upload'!F44-Report!AY10)/10","v":{"$error":"#VALUE!"}},{"$f":"+('Data upload'!G44-'Data upload'!F44)/10","v":{"$error":"#VALUE!"}},{"$f":"+('Data upload'!H44-'Data upload'!G44)/10","v":{"$error":"#VALUE!"}},{"$f":"+(AZ10-'Data upload'!H44)/10","v":{"$error":"#VALUE!"}}]
[null,null,null,null,null,null,null,null,null,null,null,null,null,null,null,{"$f":"\"Q1 = \"&IF(COUNTBLANK('Data upload'!F44:H44)+COUNTIF('Data upload'!F44:H44,\"-\")+COUNTBLANK('Data upload'!F47:H47)+COUNTIF('Data upload'!F47:H47,\"-\")+COUNTBLANK('Data upload'!F50:H50)+COUNTIF('Data upload'!F50:H50,\"-\")>=1,\"ND\",'Data upload'!F44)","v":"Q1 = ND"},null,null,null,null,null,null,null,null,null,{"$f":"\"Q2 = \"&IF(COUNTBLANK('Data upload'!F44:H44)+COUNTIF('Data upload'!F44:H44,\"-\")+COUNTBLANK('Data upload'!F47:H47)+COUNTIF('Data upload'!F47:H47,\"-\")+COUNTBLANK('Data upload'!F50:H50)+COUNTIF('Data upload'!F50:H50,\"-\")>=1,\"ND\",'Data upload'!G44)","v":"Q2 = ND"},null,null,null,null,null,null,null,null,null,{"$f":"\"Q3 = \"&IF(COUNTBLANK('Data upload'!F44:H44)+COUNTIF('Data upload'!F44:H44,\"-\")+COUNTBLANK('Data upload'!F47:H47)+COUNTIF('Data upload'!F47:H47,\"-\")+COUNTBLANK('Data upload'!F50:H50)+COUNTIF('Data upload'!F50:H50,\"-\")>=1,\"ND\",'Data upload'!H44)","v":"Q3 = ND"}]
[null,null,null,null,null,null,null,{"$f":"IF(ISERROR(TEXT('Data upload'!K90-1,\"####\")),\"\",IF('Data upload'!K90=\"\",\"\",TEXT('Data upload'!K90-1,\"####\")))","v":""}]
[null,null,null,null,{"$f":"+'Data upload'!E12","v":"N-1"},{"$f":"IF(COUNTBLANK('Data upload'!F45:H45)+COUNTIF('Data upload'!F45:H45,\"-\")+COUNTBLANK('Data upload'!F48:H48)+COUNTIF('Data upload'!F48:H48,\"-\")+COUNTBLANK('Data upload'!F51:H51)+COUNTIF('Data upload'!F51:H51,\"-\")>=1,\"Sector not valid, select another comparative aggregate\",IF(OR('EBITDA calculation'!E44=\"\",ISERROR('EBITDA calculation'!E44)),\"Not evaluable ratio\",'EBITDA calculation'!E44))","v":"Sector not valid, select another comparative aggregate"},null,{"$f":"IF(F13<AY13,\"0\",\"\")","v":{"$error":"#VALUE!"}},{"$f":"IF(F13=\"\",\"\",IF(AND(F13>=AY13,F13<(AY13+BA13)),\"0\",\"\"))","v":{"$error":"#VALUE!"}},{"$f":"IF(F13=\"\",\"\",IF(AND(F13>=AY13+BA13,F13<(AY13+(BA13*2))),\"0\",\"\"))","v":{"$error":"#VALUE!"}},{"$f":"IF(F13=\"\",\"\",IF(AND(F13>=AY13+(BA13*2),F13<(AY13+(BA13*3))),\"0\",\"\"))","v":{"$error":"#VALUE!"}},{"$f":"IF(F13=\"\",\"\",IF(AND(F13>=AY13+(BA13*3),F13<(AY13+(BA13*4))),\"0\",\"\"))","v":{"$error":"#VALUE!"}},{"$f":"IF(F13=\"\",\"\",IF(AND(F13>=AY13+(BA13*4),F13<(AY13+(BA13*5))),\"0\",\"\"))","v":{"$error":"#VALUE!"}},{"$f":"IF(F13=\"\",\"\",IF(AND(F13>=AY13+(BA13*5),F13<(AY13+(BA13*6))),\"0\",\"\"))","v":{"$error":"#VALUE!"}},{"$f":"IF(F13=\"\",\"\",IF(AND(F13>=AY13+(BA13*6),F13<(AY13+(BA13*7))),\"0\",\"\"))","v":{"$error":"#VALUE!"}},{"$f":"IF(F13=\"\",\"\",IF(AND(F13>=AY13+(BA13*7),F13<(AY13+(BA13*8))),\"0\",\"\"))","v":{"$error":"#VALUE!"}},{"$f":"IF(F13=\"\",\"\",IF(AND(F13>=AY13+(BA13*8),F13<(AY13+(BA13*9))),\"0\",\"\"))","v":{"$error":"#VALUE!"}},{"$f":"IF(F13=\"\",\"\",IF(AND(F13>=AY13+(BA13*9),F13<('Data upload'!$F$45)),\"0\",\"\"))","v":{"$error":"#VALUE!"}},{"$f":"IF(F13=\"\",\"\",IF(AND(F13>='Data upload'!$F$45,F13<('Data upload'!$F$45+BB13)),\"0\",\"\"))","v":{"$error":"#VALUE!"}},{"$f":"IF(F13=\"\",\"\",IF(AND(F13>=('Data upload'!$F$45+BB13),F13<('Data upload'!$F$45+(BB13*2))),\"0\",\"\"))","v":{"$error":"#VALUE!"}},{"$f":"IF(F13=\"\",\"\",IF(AND(F13>=('Data upload'!$F$45+(BB13*2)),F13<('Data upload'!$F$45+(BB13*3))),\"0\",\"\"))","v":{"$error":"#VALUE!"}},{"$f":"IF(F13=\"\",\"\",IF(AND(F13>=('Data upload'!$F$45+(BB13*3)),F13<('Data upload'!$F$45+(BB13*4))),\"0\",\"\"))","v":{"$error":"#VALUE!"}},{"$f":"IF(F13=\"\",\"\",IF(AND(F13>=('Data upload'!$F$45+(BB13*4)),F13<('Data upload'!$F$45+(BB13*5))),\"0\",\"\"))","v":{"$error":"#VALUE!"}},{"$f":"IF(F13=\"\",\"\",IF(AND(F13>=('Data upload'!$F$45+(BB13*5)),F13<('Data upload'!$F$45+(BB13*6))),\"0\",\"\"))","v":{"$error":"#VALUE!"}},{"$f":"IF(F13=\"\",\"\",IF(AND(F13>=('Data upload'!$F$45+(BB13*6)),F13<('Data upload'!$F$45+(BB13*7))),\"0\",\"\"))","v":{"$error":"#VALUE!"}},{"$f":"IF(F13=\"\",\"\",IF(AND(F13>=('Data upload'!$F$45+(BB13*7)),F13<('Data upload'!$F$45+(BB13*8))),\"0\",\"\"))","v":{"$error":"#VALUE!"}},{"$f":"IF(F13=\"\",\"\",IF(AND(F13>=('Data upload'!$F$45+(BB13*8)),F13<('Data upload'!$F$45+(BB13*9))),\"0\",\"\"))","v":{"$error":"#VALUE!"}},{"$f":"IF(F13=\"\",\"\",IF(AND(F13>=('Data upload'!$F$45+(BB13*9)),F13<('Data upload'!$G$45)),\"0\",\"\"))","v":{"$error":"#VALUE!"}},{"$f":"IF(F13=\"\",\"\",IF(AND(F13>='Data upload'!$G$45,F13<('Data upload'!$G$45+BC13)),\"0\",\"\"))","v":{"$error":"#VALUE!"}},{"$f":"IF(F13=\"\",\"\",IF(AND(F13>=('Data upload'!$G$45+BC13),F13<('Data upload'!$G$45+(BC13*2))),\"0\",\"\"))","v":{"$error":"#VALUE!"}},{"$f":"IF(F13=\"\",\"\",IF(AND(F13>=('Data upload'!$G$45+(BC13*2)),F13<('Data upload'!$G$45+(BC13*3))),\"0\",\"\"))","v":{"$error":"#VALUE!"}},{"$f":"IF(F13=\"\",\"\",IF(AND(F13>=('Data upload'!$G$45+(BC13*3)),F13<('Data upload'!$G$45+(BC13*4))),\"0\",\"\"))","v":{"$error":"#VALUE!"}},{"$f":"IF(F13=\"\",\"\",IF(AND(F13>=('Data upload'!$G$45+(BC13*4)),F13<('Data upload'!$G$45+(BC13*5))),\"0\",\"\"))","v":{"$error":"#VALUE!"}},{"$f":"IF(F13=\"\",\"\",IF(AND(F13>=('Data upload'!$G$45+(BC13*5)),F13<('Data upload'!$G$45+(BC13*6))),\"0\",\"\"))","v":{"$error":"#VALUE!"}},{"$f":"IF(F13=\"\",\"\",IF(AND(F13>=('Data upload'!$G$45+(BC13*6)),F13<('Data upload'!$G$45+(BC13*7))),\"0\",\"\"))","v":{"$error":"#VALUE!"}},{"$f":"IF(F13=\"\",\"\",IF(AND(F13>=('Data upload'!$G$45+(BC13*7)),F13<('Data upload'!$G$45+(BC13*8))),\"0\",\"\"))","v":{"$error":"#VALUE!"}},{"$f":"IF(F13=\"\",\"\",IF(AND(F13>=('Data upload'!$G$45+(BC13*8)),F13<('Data upload'!$G$45+(BC13*9))),\"0\",\"\"))","v":{"$error":"#VALUE!"}},{"$f":"IF(F13=\"\",\"\",IF(AND(F13>=('Data upload'!$G$45+(BC13*9)),F13<('Data upload'!$H$45)),\"0\",\"\"))","v":{"$error":"#VALUE!"}},{"$f":"IF(F13=\"\",\"\",IF(AND(F13>='Data upload'!$H$45,F13<('Data upload'!$H$45+BD13)),\"0\",\"\"))","v":{"$error":"#VALUE!"}},{"$f":"IF(F13=\"\",\"\",IF(AND(F13>=('Data upload'!$H$45+BD13),F13<('Data upload'!$H$45+(BD13*2))),\"0\",\"\"))","v":{"$error":"#VALUE!"}},{"$f":"IF(F13=\"\",\"\",IF(AND(F13>=('Data upload'!$H$45+(BD13*2)),F13<('Data upload'!$H$45+(BD13*3))),\"0\",\"\"))","v":{"$error":"#VALUE!"}},{"$f":"IF(F13=\"\",\"\",IF(AND(F13>=('Data upload'!$H$45+(BD13*3)),F13<('Data upload'!$H$45+(BD13*4))),\"0\",\"\"))","v":{"$error":"#VALUE!"}},{"$f":"IF(F13=\"\",\"\",IF(AND(F13>=('Data upload'!$H$45+(BD13*4)),F13<('Data upload'!$H$45+(BD13*5))),\"0\",\"\"))","v":{"$error":"#VALUE!"}},{"$f":"IF(F13=\"\",\"\",IF(AND(F13>=('Data upload'!$H$45+(BD13*5)),F13<('Data upload'!$H$45+(BD13*6))),\"0\",\"\"))","v":{"$error":"#VALUE!"}},{"$f":"IF(F13=\"\",\"\",IF(AND(F13>=('Data upload'!$H$45+(BD13*6)),F13<('Data upload'!$H$45+(BD13*7))),\"0\",\"\"))","v":{"$error":"#VALUE!"}},{"$f":"IF(F13=\"\",\"\",IF(AND(F13>=('Data upload'!$H$45+(BD13*7)),F13<('Data upload'!$H$45+(BD13*8))),\"0\",\"\"))","v":{"$error":"#VALUE!"}},{"$f":"IF(F13=\"\",\"\",IF(AND(F13>=('Data upload'!$H$45+(BD13*8)),F13<('Data upload'!$H$45+(BD13*9))),\"0\",\"\"))","v":{"$error":"#VALUE!"}},{"$f":"IF(F13=\"\",\"\",IF(AND(F13>=('Data upload'!$H$45+(BD13*9)),F13<(AZ13)),\"0\",\"\"))","v":{"$error":"#VALUE!"}},{"$f":"IF(OR(F13=\"Not evaluable ratio\",F13=\"Sector no válido, seleccione otro agregado de comparación\"),\"\",IF(F13>=AZ13,\"0\",\"\"))","v":{"$error":"#VALUE!"}},null,{"$f":"+'Data upload'!F45-('Data upload'!G45-'Data upload'!F45)","v":{"$error":"#VALUE!"}},{"$f":"+'Data upload'!H45+('Data upload'!H45-'Data upload'!G45)","v":{"$error":"#VALUE!"}},{"$f":"+('Data upload'!F45-Report!AY13)/10","v":{"$error":"#VALUE!"}},{"$f":"+('Data upload'!G45-'Data upload'!F45)/10","v":{"$error":"#VALUE!"}},{"$f":"+('Data upload'!H45-'Data upload'!G45)/10","v":{"$error":"#VALUE!"}},{"$f":"+(AZ13-'Data upload'!H45)/10","v":{"$error":"#VALUE!"}}]
[null,null,null,null,null,null,null,null,null,null,null,null,null,null,null,{"$f":"\"Q1 = \"&IF(COUNTBLANK('Data upload'!F45:H45)+COUNTIF('Data upload'!F45:H45,\"-\")+COUNTBLANK('Data upload'!F48:H48)+COUNTIF('Data upload'!F48:H48,\"-\")+COUNTBLANK('Data upload'!F51:H51)+COUNTIF('Data upload'!F51:H51,\"-\")>=1,\"ND\",'Data upload'!F45)","v":"Q1 = ND"},null,null,null,null,null,null,null,null,null,{"$f":"\"Q2 = \"&IF(COUNTBLANK('Data upload'!F45:H45)+COUNTIF('Data upload'!F45:H45,\"-\")+COUNTBLANK('Data upload'!F48:H48)+COUNTIF('Data upload'!F48:H48,\"-\")+COUNTBLANK('Data upload'!F51:H51)+COUNTIF('Data upload'!F51:H51,\"-\")>=1,\"ND\",'Data upload'!G45)","v":"Q2 = ND"},null,null,null,null,null,null,null,null,null,{"$f":"\"Q3 = \"&IF(COUNTBLANK('Data upload'!F45:H45)+COUNTIF('Data upload'!F45:H45,\"-\")+COUNTBLANK('Data upload'!F48:H48)+COUNTIF('Data upload'!F48:H48,\"-\")+COUNTBLANK('Data upload'!F51:H51)+COUNTIF('Data upload'!F51:H51,\"-\")>=1,\"ND\",'Data upload'!H45)","v":"Q3 = ND"}]
[null,null,null,null,null,null,null,{"$f":"IF(ISERROR(TEXT('Data upload'!K90,\"####\")),\"\",TEXT('Data upload'!K90,\"####\"))","v":""}]
[null,"     R22. EBITDA / Financial expenses",null,null,{"$f":"+'Data upload'!G12","v":"N"},{"$f":"IF(COUNTBLANK('Data upload'!F44:H44)+COUNTIF('Data upload'!F44:H44,\"-\")+COUNTBLANK('Data upload'!F47:H47)+COUNTIF('Data upload'!F47:H47,\"-\")+COUNTBLANK('Data upload'!F50:H50)+COUNTIF('Data upload'!F50:H50,\"-\")>=1,\"Sector not valid, select another comparative aggregate\",IF(OR('EBITDA calculation'!F45=\"\",ISERROR('EBITDA calculation'!F45)),\"Not evaluable ratio\",'EBITDA calculation'!F45))","v":"Sector not valid, select another comparative aggregate"},null,{"$f":"IF(F16<AY16,\"0\",\"\")","v":{"$error":"#VALUE!"}},{"$f":"IF(F16=\"\",\"\",IF(AND(F16>=AY16,F16<(AY16+BA16)),\"0\",\"\"))","v":{"$error":"#VALUE!"}},{"$f":"IF(F16=\"\",\"\",IF(AND(F16>=AY16+BA16,F16<(AY16+(BA16*2))),\"0\",\"\"))","v":{"$error":"#VALUE!"}},{"$f":"IF(F16=\"\",\"\",IF(AND(F16>=AY16+(BA16*2),F16<(AY16+(BA16*3))),\"0\",\"\"))","v":{"$error":"#VALUE!"}},{"$f":"IF(F16=\"\",\"\",IF(AND(F16>=AY16+(BA16*3),F16<(AY16+(BA16*4))),\"0\",\"\"))","v":{"$error":"#VALUE!"}},{"$f":"IF(F16=\"\",\"\",IF(AND(F16>=AY16+(BA16*4),F16<(AY16+(BA16*5))),\"0\",\"\"))","v":{"$error":"#VALUE!"}},{"$f":"IF(F16=\"\",\"\",IF(AND(F16>=AY16+(BA16*5),F16<(AY16+(BA16*6))),\"0\",\"\"))","v":{"$error":"#VALUE!"}},{"$f":"IF(F16=\"\",\"\",IF(AND(F16>=AY16+(BA16*6),F16<(AY16+(BA16*7))),\"0\",\"\"))","v":{"$error":"#VALUE!"}},{"$f":"IF(F16=\"\",\"\",IF(AND(F16>=AY16+(BA16*7),F16<(AY16+(BA16*8))),\"0\",\"\"))","v":{"$error":"#VALUE!"}},{"$f":"IF(F16=\"\",\"\",IF(AND(F16>=AY16+(BA16*8),F16<(AY16+(BA16*9))),\"0\",\"\"))","v":{"$error":"#VALUE!"}},{"$f":"IF(F16=\"\",\"\",IF(AND(F16>=AY16+(BA16*9),F16<('Data upload'!$F$47)),\"0\",\"\"))","v":{"$error":"#VALUE!"}},{"$f":"IF(F16=\"\",\"\",IF(AND(F16>='Data upload'!$F$47,F16<('Data upload'!$F$47+BB16)),\"0\",\"\"))","v":{"$error":"#VALUE!"}},{"$f":"IF(F16=\"\",\"\",IF(AND(F16>=('Data upload'!$F$47+BB16),F16<('Data upload'!$F$47+(BB16*2))),\"0\",\"\"))","v":{"$error":"#VALUE!"}},{"$f":"IF(F16=\"\",\"\",IF(AND(F16>=('Data upload'!$F$47+(BB16*2)),F16<('Data upload'!$F$47+(BB16*3))),\"0\",\"\"))","v":{"$error":"#VALUE!"}},{"$f":"IF(F16=\"\",\"\",IF(AND(F16>=('Data upload'!$F$47+(BB16*3)),F16<('Data upload'!$F$47+(BB16*4))),\"0\",\"\"))","v":{"$error":"#VALUE!"}},{"$f":"IF(F16=\"\",\"\",IF(AND(F16>=('Data upload'!$F$47+(BB16*4)),F16<('Data upload'!$F$47+(BB16*5))),\"0\",\"\"))","v":{"$error":"#VALUE!"}},{"$f":"IF(F16=\"\",\"\",IF(AND(F16>=('Data upload'!$F$47+(BB16*5)),F16<('Data upload'!$F$47+(BB16*6))),\"0\",\"\"))","v":{"$error":"#VALUE!"}},{"$f":"IF(F16=\"\",\"\",IF(AND(F16>=('Data upload'!$F$47+(BB16*6)),F16<('Data upload'!$F$47+(BB16*7))),\"0\",\"\"))","v":{"$error":"#VALUE!"}},{"$f":"IF(F16=\"\",\"\",IF(AND(F16>=('Data upload'!$F$47+(BB16*7)),F16<('Data upload'!$F$47+(BB16*8))),\"0\",\"\"))","v":{"$error":"#VALUE!"}},{"$f":"IF(F16=\"\",\"\",IF(AND(F16>=('Data upload'!$F$47+(BB16*8)),F16<('Data upload'!$F$47+(BB16*9))),\"0\",\"\"))","v":{"$error":"#VALUE!"}},{"$f":"IF(F16=\"\",\"\",IF(AND(F16>=('Data upload'!$F$47+(BB16*9)),F16<('Data upload'!$G$47)),\"0\",\"\"))","v":{"$error":"#VALUE!"}},{"$f":"IF(F16=\"\",\"\",IF(AND(F16>='Data upload'!$G$47,F16<('Data upload'!$G$47+BC16)),\"0\",\"\"))","v":{"$error":"#VALUE!"}},{"$f":"IF(F16=\"\",\"\",IF(AND(F16>=('Data upload'!$G$47+BC16),F16<('Data upload'!$G$47+(BC16*2))),\"0\",\"\"))","v":{"$error":"#VALUE!"}},{"$f":"IF(F16=\"\",\"\",IF(AND(F16>=('Data upload'!$G$47+(BC16*2)),F16<('Data upload'!$G$47+(BC16*3))),\"0\",\"\"))","v":{"$error":"#VALUE!"}},{"$f":"IF(F16=\"\",\"\",IF(AND(F16>=('Data upload'!$G$47+(BC16*3)),F16<('Data upload'!$G$47+(BC16*4))),\"0\",\"\"))","v":{"$error":"#VALUE!"}},{"$f":"IF(F16=\"\",\"\",IF(AND(F16>=('Data upload'!$G$47+(BC16*4)),F16<('Data upload'!$G$47+(BC16*5))),\"0\",\"\"))","v":{"$error":"#VALUE!"}},{"$f":"IF(F16=\"\",\"\",IF(AND(F16>=('Data upload'!$G$47+(BC16*5)),F16<('Data upload'!$G$47+(BC16*6))),\"0\",\"\"))","v":{"$error":"#VALUE!"}},{"$f":"IF(F16=\"\",\"\",IF(AND(F16>=('Data upload'!$G$47+(BC16*6)),F16<('Data upload'!$G$47+(BC16*7))),\"0\",\"\"))","v":{"$error":"#VALUE!"}},{"$f":"IF(F16=\"\",\"\",IF(AND(F16>=('Data upload'!$G$47+(BC16*7)),F16<('Data upload'!$G$47+(BC16*8))),\"0\",\"\"))","v":{"$error":"#VALUE!"}},{"$f":"IF(F16=\"\",\"\",IF(AND(F16>=('Data upload'!$G$47+(BC16*8)),F16<('Data upload'!$G$47+(BC16*9))),\"0\",\"\"))","v":{"$error":"#VALUE!"}},{"$f":"IF(F16=\"\",\"\",IF(AND(F16>=('Data upload'!$G$47+(BC16*9)),F16<('Data upload'!$H$47)),\"0\",\"\"))","v":{"$error":"#VALUE!"}},{"$f":"IF(F16=\"\",\"\",IF(AND(F16>='Data upload'!$H$47,F16<('Data upload'!$H$47+BD16)),\"0\",\"\"))","v":{"$error":"#VALUE!"}},{"$f":"IF(F16=\"\",\"\",IF(AND(F16>=('Data upload'!$H$47+BD16),F16<('Data upload'!$H$47+(BD16*2))),\"0\",\"\"))","v":{"$error":"#VALUE!"}},{"$f":"IF(F16=\"\",\"\",IF(AND(F16>=('Data upload'!$H$47+(BD16*2)),F16<('Data upload'!$H$47+(BD16*3))),\"0\",\"\"))","v":{"$error":"#VALUE!"}},{"$f":"IF(F16=\"\",\"\",IF(AND(F16>=('Data upload'!$H$47+(BD16*3)),F16<('Data upload'!$H$47+(BD16*4))),\"0\",\"\"))","v":{"$error":"#VALUE!"}},{"$f":"IF(F16=\"\",\"\",IF(AND(F16>=('Data upload'!$H$47+(BD16*4)),F16<('Data upload'!$H$47+(BD16*5))),\"0\",\"\"))","v":{"$error":"#VALUE!"}},{"$f":"IF(F16=\"\",\"\",IF(AND(F16>=('Data upload'!$H$47+(BD16*5)),F16<('Data upload'!$H$47+(BD16*6))),\"0\",\"\"))","v":{"$error":"#VALUE!"}},{"$f":"IF(F16=\"\",\"\",IF(AND(F16>=('Data upload'!$H$47+(BD16*6)),F16<('Data upload'!$H$47+(BD16*7))),\"0\",\"\"))","v":{"$error":"#VALUE!"}},{"$f":"IF(F16=\"\",\"\",IF(AND(F16>=('Data upload'!$H$47+(BD16*7)),F16<('Data upload'!$H$47+(BD16*8))),\"0\",\"\"))","v":{"$error":"#VALUE!"}},{"$f":"IF(F16=\"\",\"\",IF(AND(F16>=('Data upload'!$H$47+(BD16*8)),F16<('Data upload'!$H$47+(BD16*9))),\"0\",\"\"))","v":{"$error":"#VALUE!"}},{"$f":"IF(F16=\"\",\"\",IF(AND(F16>=('Data upload'!$H$47+(BD16*9)),F16<(AZ16)),\"0\",\"\"))","v":{"$error":"#VALUE!"}},{"$f":"IF(OR(F16=\"Not evaluable ratio\",F16=\"Sector no válido, seleccione otro agregado de comparación\"),\"\",IF(F16>=AZ16,\"0\",\"\"))","v":{"$error":"#VALUE!"}},null,{"$f":"+'Data upload'!F47-('Data upload'!G47-'Data upload'!F47)","v":{"$error":"#VALUE!"}},{"$f":"+'Data upload'!H47+('Data upload'!H47-'Data upload'!G47)","v":{"$error":"#VALUE!"}},{"$f":"+('Data upload'!F47-Report!AY16)/10","v":{"$error":"#VALUE!"}},{"$f":"+('Data upload'!G47-'Data upload'!F47)/10","v":{"$error":"#VALUE!"}},{"$f":"+('Data upload'!H47-'Data upload'!G47)/10","v":{"$error":"#VALUE!"}},{"$f":"+(AZ16-'Data upload'!H47)/10","v":{"$error":"#VALUE!"}}]
[null,null,null,null,null,null,null,null,null,null,null,null,null,null,null,{"$f":"\"Q1 = \"&IF(COUNTBLANK('Data upload'!F44:H44)+COUNTIF('Data upload'!F44:H44,\"-\")+COUNTBLANK('Data upload'!F47:H47)+COUNTIF('Data upload'!F47:H47,\"-\")+COUNTBLANK('Data upload'!F50:H50)+COUNTIF('Data upload'!F50:H50,\"-\")>=1,\"ND\",'Data upload'!F47)","v":"Q1 = ND"},null,null,null,null,null,null,null,null,null,{"$f":"\"Q2 = \"&IF(COUNTBLANK('Data upload'!F44:H44)+COUNTIF('Data upload'!F44:H44,\"-\")+COUNTBLANK('Data upload'!F47:H47)+COUNTIF('Data upload'!F47:H47,\"-\")+COUNTBLANK('Data upload'!F50:H50)+COUNTIF('Data upload'!F50:H50,\"-\")>=1,\"ND\",'Data upload'!G47)","v":"Q2 = ND"},null,null,null,null,null,null,null,null,null,{"$f":"\"Q3 = \"&IF(COUNTBLANK('Data upload'!F44:H44)+COUNTIF('Data upload'!F44:H44,\"-\")+COUNTBLANK('Data upload'!F47:H47)+COUNTIF('Data upload'!F47:H47,\"-\")+COUNTBLANK('Data upload'!F50:H50)+COUNTIF('Data upload'!F50:H50,\"-\")>=1,\"ND\",'Data upload'!H47)","v":"Q3 = ND"}]
[null,null,null,null,null,null,null,{"$f":"IF(ISERROR(TEXT('Data upload'!K90-1,\"####\")),\"\",IF('Data upload'!K90=\"\",\"\",TEXT('Data upload'!K90-1,\"####\")))","v":""}]
[null,null,null,null,{"$f":"+'Data upload'!E12","v":"N-1"},{"$f":"IF(COUNTBLANK('Data upload'!F45:H45)+COUNTIF('Data upload'!F45:H45,\"-\")+COUNTBLANK('Data upload'!F48:H48)+COUNTIF('Data upload'!F48:H48,\"-\")+COUNTBLANK('Data upload'!F51:H51)+COUNTIF('Data upload'!F51:H51,\"-\")>=1,\"Sector not valid, select another comparative aggregate\",IF(OR('EBITDA calculation'!E45=\"\",ISERROR('EBITDA calculation'!E45)),\"Not evaluable ratio\",'EBITDA calculation'!E45))","v":"Sector not valid, select another comparative aggregate"},null,{"$f":"IF(F19<AY19,\"0\",\"\")","v":{"$error":"#VALUE!"}},{"$f":"IF(F19=\"\",\"\",IF(AND(F19>=AY19,F19<(AY19+BA19)),\"0\",\"\"))","v":{"$error":"#VALUE!"}},{"$f":"IF(F19=\"\",\"\",IF(AND(F19>=AY19+BA19,F19<(AY19+(BA19*2))),\"0\",\"\"))","v":{"$error":"#VALUE!"}},{"$f":"IF(F19=\"\",\"\",IF(AND(F19>=AY19+(BA19*2),F19<(AY19+(BA19*3))),\"0\",\"\"))","v":{"$error":"#VALUE!"}},{"$f":"IF(F19=\"\",\"\",IF(AND(F19>=AY19+(BA19*3),F19<(AY19+(BA19*4))),\"0\",\"\"))","v":{"$error":"#VALUE!"}},{"$f":"IF(F19=\"\",\"\",IF(AND(F19>=AY19+(BA19*4),F19<(AY19+(BA19*5))),\"0\",\"\"))","v":{"$error":"#VALUE!"}},{"$f":"IF(F19=\"\",\"\",IF(AND(F19>=AY19+(BA19*5),F19<(AY19+(BA19*6))),\"0\",\"\"))","v":{"$error":"#VALUE!"}},{"$f":"IF(F19=\"\",\"\",IF(AND(F19>=AY19+(BA19*6),F19<(AY19+(BA19*7))),\"0\",\"\"))","v":{"$error":"#VALUE!"}},{"$f":"IF(F19=\"\",\"\",IF(AND(F19>=AY19+(BA19*7),F19<(AY19+(BA19*8))),\"0\",\"\"))","v":{"$error":"#VALUE!"}},{"$f":"IF(F19=\"\",\"\",IF(AND(F19>=AY19+(BA19*8),F19<(AY19+(BA19*9))),\"0\",\"\"))","v":{"$error":"#VALUE!"}},{"$f":"IF(F19=\"\",\"\",IF(AND(F19>=AY19+(BA19*9),F19<('Data upload'!F48)),\"0\",\"\"))","v":{"$error":"#VALUE!"}},{"$f":"IF(F19=\"\",\"\",IF(AND(F19>='Data upload'!F48,F19<('Data upload'!F48+BB19)),\"0\",\"\"))","v":{"$error":"#VALUE!"}},{"$f":"IF(F19=\"\",\"\",IF(AND(F19>=('Data upload'!F48+BB19),F19<('Data upload'!F48+(BB19*2))),\"0\",\"\"))","v":{"$error":"#VALUE!"}},{"$f":"IF(F19=\"\",\"\",IF(AND(F19>=('Data upload'!F48+(BB19*2)),F19<('Data upload'!F48+(BB19*3))),\"0\",\"\"))","v":{"$error":"#VALUE!"}},{"$f":"IF(F19=\"\",\"\",IF(AND(F19>=('Data upload'!F48+(BB19*3)),F19<('Data upload'!F48+(BB19*4))),\"0\",\"\"))","v":{"$error":"#VALUE!"}},{"$f":"IF(F19=\"\",\"\",IF(AND(F19>=('Data upload'!F48+(BB19*4)),F19<('Data upload'!F48+(BB19*5))),\"0\",\"\"))","v":{"$error":"#VALUE!"}},{"$f":"IF(F19=\"\",\"\",IF(AND(F19>=('Data upload'!F48+(BB19*5)),F19<('Data upload'!F48+(BB19*6))),\"0\",\"\"))","v":{"$error":"#VALUE!"}},{"$f":"IF(F19=\"\",\"\",IF(AND(F19>=('Data upload'!F48+(BB19*6)),F19<('Data upload'!F48+(BB19*7))),\"0\",\"\"))","v":{"$error":"#VALUE!"}},{"$f":"IF(F19=\"\",\"\",IF(AND(F19>=('Data upload'!F48+(BB19*7)),F19<('Data upload'!F48+(BB19*8))),\"0\",\"\"))","v":{"$error":"#VALUE!"}},{"$f":"IF(F19=\"\",\"\",IF(AND(F19>=('Data upload'!F48+(BB19*8)),F19<('Data upload'!F48+(BB19*9))),\"0\",\"\"))","v":{"$error":"#VALUE!"}},{"$f":"IF(F19=\"\",\"\",IF(AND(F19>=('Data upload'!F48+(BB19*9)),F19<('Data upload'!$G$48)),\"0\",\"\"))","v":{"$error":"#VALUE!"}},{"$f":"IF(F19=\"\",\"\",IF(AND(F19>='Data upload'!$G$48,F19<('Data upload'!$G$48+BC19)),\"0\",\"\"))","v":{"$error":"#VALUE!"}},{"$f":"IF(F19=\"\",\"\",IF(AND(F19>=('Data upload'!$G$48+BC19),F19<('Data upload'!$G$48+(BC19*2))),\"0\",\"\"))","v":{"$error":"#VALUE!"}},{"$f":"IF(F19=\"\",\"\",IF(AND(F19>=('Data upload'!$G$48+(BC19*2)),F19<('Data upload'!$G$48+(BC19*3))),\"0\",\"\"))","v":{"$error":"#VALUE!"}},{"$f":"IF(F19=\"\",\"\",IF(AND(F19>=('Data upload'!$G$48+(BC19*3)),F19<('Data upload'!$G$48+(BC19*4))),\"0\",\"\"))","v":{"$error":"#VALUE!"}},{"$f":"IF(F19=\"\",\"\",IF(AND(F19>=('Data upload'!$G$48+(BC19*4)),F19<('Data upload'!$G$48+(BC19*5))),\"0\",\"\"))","v":{"$error":"#VALUE!"}},{"$f":"IF(F19=\"\",\"\",IF(AND(F19>=('Data upload'!$G$48+(BC19*5)),F19<('Data upload'!$G$48+(BC19*6))),\"0\",\"\"))","v":{"$error":"#VALUE!"}},{"$f":"IF(F19=\"\",\"\",IF(AND(F19>=('Data upload'!$G$48+(BC19*6)),F19<('Data upload'!$G$48+(BC19*7))),\"0\",\"\"))","v":{"$error":"#VALUE!"}},{"$f":"IF(F19=\"\",\"\",IF(AND(F19>=('Data upload'!$G$48+(BC19*7)),F19<('Data upload'!$G$48+(BC19*8))),\"0\",\"\"))","v":{"$error":"#VALUE!"}},{"$f":"IF(F19=\"\",\"\",IF(AND(F19>=('Data upload'!$G$48+(BC19*8)),F19<('Data upload'!$G$48+(BC19*9))),\"0\",\"\"))","v":{"$error":"#VALUE!"}},{"$f":"IF(F19=\"\",\"\",IF(AND(F19>=('Data upload'!$G$48+(BC19*9)),F19<('Data upload'!H48)),\"0\",\"\"))","v":{"$error":"#VALUE!"}},{"$f":"IF(F19=\"\",\"\",IF(AND(F19>='Data upload'!H48,F19<('Data upload'!H48+BD19)),\"0\",\"\"))","v":{"$error":"#VALUE!"}},{"$f":"IF(F19=\"\",\"\",IF(AND(F19>=('Data upload'!H48+BD19),F19<('Data upload'!H48+(BD19*2))),\"0\",\"\"))","v":{"$error":"#VALUE!"}},{"$f":"IF(F19=\"\",\"\",IF(AND(F19>=('Data upload'!H48+(BD19*2)),F19<('Data upload'!H48+(BD19*3))),\"0\",\"\"))","v":{"$error":"#VALUE!"}},{"$f":"IF(F19=\"\",\"\",IF(AND(F19>=('Data upload'!H48+(BD19*3)),F19<('Data upload'!H48+(BD19*4))),\"0\",\"\"))","v":{"$error":"#VALUE!"}},{"$f":"IF(F19=\"\",\"\",IF(AND(F19>=('Data upload'!H48+(BD19*4)),F19<('Data upload'!H48+(BD19*5))),\"0\",\"\"))","v":{"$error":"#VALUE!"}},{"$f":"IF(F19=\"\",\"\",IF(AND(F19>=('Data upload'!H48+(BD19*5)),F19<('Data upload'!H48+(BD19*6))),\"0\",\"\"))","v":{"$error":"#VALUE!"}},{"$f":"IF(F19=\"\",\"\",IF(AND(F19>=('Data upload'!H48+(BD19*6)),F19<('Data upload'!H48+(BD19*7))),\"0\",\"\"))","v":{"$error":"#VALUE!"}},{"$f":"IF(F19=\"\",\"\",IF(AND(F19>=('Data upload'!H48+(BD19*7)),F19<('Data upload'!H48+(BD19*8))),\"0\",\"\"))","v":{"$error":"#VALUE!"}},{"$f":"IF(F19=\"\",\"\",IF(AND(F19>=('Data upload'!H48+(BD19*8)),F19<('Data upload'!H48+(BD19*9))),\"0\",\"\"))","v":{"$error":"#VALUE!"}},{"$f":"IF(F19=\"\",\"\",IF(AND(F19>=('Data upload'!H48+(BD19*9)),F19<(AZ19)),\"0\",\"\"))","v":{"$error":"#VALUE!"}},{"$f":"IF(OR(F19=\"Not evaluable ratio\",F19=\"Sector no válido, seleccione otro agregado de comparación\"),\"\",IF(F19>=AZ19,\"0\",\"\"))","v":{"$error":"#VALUE!"}},null,{"$f":"+'Data upload'!F48-('Data upload'!G48-'Data upload'!F48)","v":{"$error":"#VALUE!"}},{"$f":"+'Data upload'!H48+('Data upload'!H48-'Data upload'!G48)","v":{"$error":"#VALUE!"}},{"$f":"+('Data upload'!F48-Report!AY19)/10","v":{"$error":"#VALUE!"}},{"$f":"+('Data upload'!G48-'Data upload'!F48)/10","v":{"$error":"#VALUE!"}},{"$f":"+('Data upload'!H48-'Data upload'!G48)/10","v":{"$error":"#VALUE!"}},{"$f":"+(AZ19-'Data upload'!H48)/10","v":{"$error":"#VALUE!"}}]
[null,null,null,null,null,null,null,null,null,null,null,null,null,null,null,{"$f":"\"Q1 = \"&IF(COUNTBLANK('Data upload'!F45:H45)+COUNTIF('Data upload'!F45:H45,\"-\")+COUNTBLANK('Data upload'!F48:H48)+COUNTIF('Data upload'!F48:H48,\"-\")+COUNTBLANK('Data upload'!F51:H51)+COUNTIF('Data upload'!F51:H51,\"-\")>=1,\"ND\",'Data upload'!F48)","v":"Q1 = ND"},null,null,null,null,null,null,null,null,null,{"$f":"\"Q2 = \"&IF(COUNTBLANK('Data upload'!F45:H45)+COUNTIF('Data upload'!F45:H45,\"-\")+COUNTBLANK('Data upload'!F48:H48)+COUNTIF('Data upload'!F48:H48,\"-\")+COUNTBLANK('Data upload'!F51:H51)+COUNTIF('Data upload'!F51:H51,\"-\")>=1,\"ND\",'Data upload'!G48)","v":"Q2 = ND"},null,null,null,null,null,null,null,null,null,{"$f":"\"Q3 = \"&IF(COUNTBLANK('Data upload'!F45:H45)+COUNTIF('Data upload'!F45:H45,\"-\")+COUNTBLANK('Data upload'!F48:H48)+COUNTIF('Data upload'!F48:H48,\"-\")+COUNTBLANK('Data upload'!F51:H51)+COUNTIF('Data upload'!F51:H51,\"-\")>=1,\"ND\",'Data upload'!H48)","v":"Q3 = ND"}]
[null,null,null,null,null,null,null,{"$f":"IF(ISERROR(TEXT('Data upload'!K90,\"####\")),\"\",TEXT('Data upload'!K90,\"####\"))","v":""}]
[null,"     R21. Financial income /EBITDA",null,null,{"$f":"+'Data upload'!G12","v":"N"},{"$f":"IF(COUNTBLANK('Data upload'!F44:H44)+COUNTIF('Data upload'!F44:H44,\"-\")+COUNTBLANK('Data upload'!F47:H47)+COUNTIF('Data upload'!F47:H47,\"-\")+COUNTBLANK('Data upload'!F50:H50)+COUNTIF('Data upload'!F50:H50,\"-\")>=1,\"Sector not valid, select another comparative aggregate\",IF(OR('EBITDA calculation'!F46=\"\",ISERROR('EBITDA calculation'!F46)),\"Not evaluable ratio\",'EBITDA calculation'!F46))","v":"Sector not valid, select another comparative aggregate"},null,{"$f":"IF(F22<AY22,\"0\",\"\")","v":{"$error":"#VALUE!"}},{"$f":"IF(F22=\"\",\"\",IF(AND(F22>=AY22,F22<(AY22+BA22)),\"0\",\"\"))","v":{"$error":"#VALUE!"}},{"$f":"IF(F22=\"\",\"\",IF(AND(F22>=AY22+BA22,F22<(AY22+(BA22*2))),\"0\",\"\"))","v":{"$error":"#VALUE!"}},{"$f":"IF(F22=\"\",\"\",IF(AND(F22>=AY22+(BA22*2),F22<(AY22+(BA22*3))),\"0\",\"\"))","v":{"$error":"#VALUE!"}},{"$f":"IF(F22=\"\",\"\",IF(AND(F22>=AY22+(BA22*3),F22<(AY22+(BA22*4))),\"0\",\"\"))","v":{"$error":"#VALUE!"}},{"$f":"IF(F22=\"\",\"\",IF(AND(F22>=AY22+(BA22*4),F22<(AY22+(BA22*5))),\"0\",\"\"))","v":{"$error":"#VALUE!"}},{"$f":"IF(F22=\"\",\"\",IF(AND(F22>=AY22+(BA22*5),F22<(AY22+(BA22*6))),\"0\",\"\"))","v":{"$error":"#VALUE!"}},{"$f":"IF(F22=\"\",\"\",IF(AND(F22>=AY22+(BA22*6),F22<(AY22+(BA22*7))),\"0\",\"\"))","v":{"$error":"#VALUE!"}},{"$f":"IF(F22=\"\",\"\",IF(AND(F22>=AY22+(BA22*7),F22<(AY22+(BA22*8))),\"0\",\"\"))","v":{"$error":"#VALUE!"}},{"$f":"IF(F22=\"\",\"\",IF(AND(F22>=AY22+(BA22*8),F22<(AY22+(BA22*9))),\"0\",\"\"))","v":{"$error":"#VALUE!"}},{"$f":"IF(F22=\"\",\"\",IF(AND(F22>=AY22+(BA22*9),F22<('Data upload'!F50)),\"0\",\"\"))","v":{"$error":"#VALUE!"}},{"$f":"IF(F22=\"\",\"\",IF(AND(F22>='Data upload'!F50,F22<('Data upload'!F50+BB22)),\"0\",\"\"))","v":{"$error":"#VALUE!"}},{"$f":"IF(F22=\"\",\"\",IF(AND(F22>=('Data upload'!F50+BB22),F22<('Data upload'!F50+(BB22*2))),\"0\",\"\"))","v":{"$error":"#VALUE!"}},{"$f":"IF(F22=\"\",\"\",IF(AND(F22>=('Data upload'!F50+(BB22*2)),F22<('Data upload'!F50+(BB22*3))),\"0\",\"\"))","v":{"$error":"#VALUE!"}},{"$f":"IF(F22=\"\",\"\",IF(AND(F22>=('Data upload'!F50+(BB22*3)),F22<('Data upload'!F50+(BB22*4))),\"0\",\"\"))","v":{"$error":"#VALUE!"}},{"$f":"IF(F22=\"\",\"\",IF(AND(F22>=('Data upload'!F50+(BB22*4)),F22<('Data upload'!F50+(BB22*5))),\"0\",\"\"))","v":{"$error":"#VALUE!"}},{"$f":"IF(F22=\"\",\"\",IF(AND(F22>=('Data upload'!F50+(BB22*5)),F22<('Data upload'!F50+(BB22*6))),\"0\",\"\"))","v":{"$error":"#VALUE!"}},{"$f":"IF(F22=\"\",\"\",IF(AND(F22>=('Data upload'!F50+(BB22*6)),F22<('Data upload'!F50+(BB22*7))),\"0\",\"\"))","v":{"$error":"#VALUE!"}},{"$f":"IF(F22=\"\",\"\",IF(AND(F22>=('Data upload'!F50+(BB22*7)),F22<('Data upload'!F50+(BB22*8))),\"0\",\"\"))","v":{"$error":"#VALUE!"}},{"$f":"IF(F22=\"\",\"\",IF(AND(F22>=('Data upload'!F50+(BB22*8)),F22<('Data upload'!F50+(BB22*9))),\"0\",\"\"))","v":{"$error":"#VALUE!"}},{"$f":"IF(F22=\"\",\"\",IF(AND(F22>=('Data upload'!F50+(BB22*9)),F22<('Data upload'!$G$50)),\"0\",\"\"))","v":{"$error":"#VALUE!"}},{"$f":"IF(F22=\"\",\"\",IF(AND(F22>='Data upload'!G50,F22<('Data upload'!G50+BC22)),\"0\",\"\"))","v":{"$error":"#VALUE!"}},{"$f":"IF(F22=\"\",\"\",IF(AND(F22>=('Data upload'!G50+BC22),F22<('Data upload'!G50+(BC22*2))),\"0\",\"\"))","v":{"$error":"#VALUE!"}},{"$f":"IF(F22=\"\",\"\",IF(AND(F22>=('Data upload'!G50+(BC22*2)),F22<('Data upload'!G50+(BC22*3))),\"0\",\"\"))","v":{"$error":"#VALUE!"}},{"$f":"IF(F22=\"\",\"\",IF(AND(F22>=('Data upload'!G50+(BC22*3)),F22<('Data upload'!G50+(BC22*4))),\"0\",\"\"))","v":{"$error":"#VALUE!"}},{"$f":"IF(F22=\"\",\"\",IF(AND(F22>=('Data upload'!G50+(BC22*4)),F22<('Data upload'!G50+(BC22*5))),\"0\",\"\"))","v":{"$error":"#VALUE!"}},{"$f":"IF(F22=\"\",\"\",IF(AND(F22>=('Data upload'!G50+(BC22*5)),F22<('Data upload'!G50+(BC22*6))),\"0\",\"\"))","v":{"$error":"#VALUE!"}},{"$f":"IF(F22=\"\",\"\",IF(AND(F22>=('Data upload'!G50+(BC22*6)),F22<('Data upload'!G50+(BC22*7))),\"0\",\"\"))","v":{"$error":"#VALUE!"}},{"$f":"IF(F22=\"\",\"\",IF(AND(F22>=('Data upload'!G50+(BC22*7)),F22<('Data upload'!G50+(BC22*8))),\"0\",\"\"))","v":{"$error":"#VALUE!"}},{"$f":"IF(F22=\"\",\"\",IF(AND(F22>=('Data upload'!G50+(BC22*8)),F22<('Data upload'!G50+(BC22*9))),\"0\",\"\"))","v":{"$error":"#VALUE!"}},{"$f":"IF(F22=\"\",\"\",IF(AND(F22>=('Data upload'!G50+(BC22*9)),F22<('Data upload'!$H$50)),\"0\",\"\"))","v":{"$error":"#VALUE!"}},{"$f":"IF(F22=\"\",\"\",IF(AND(F22>='Data upload'!H50,F22<('Data upload'!H50+BD22)),\"0\",\"\"))","v":{"$error":"#VALUE!"}},{"$f":"IF(F22=\"\",\"\",IF(AND(F22>=('Data upload'!H50+BD22),F22<('Data upload'!H50+(BD22*2))),\"0\",\"\"))","v":{"$error":"#VALUE!"}},{"$f":"IF(F22=\"\",\"\",IF(AND(F22>=('Data upload'!H50+(BD22*2)),F22<('Data upload'!H50+(BD22*3))),\"0\",\"\"))","v":{"$error":"#VALUE!"}},{"$f":"IF(F22=\"\",\"\",IF(AND(F22>=('Data upload'!H50+(BD22*3)),F22<('Data upload'!H50+(BD22*4))),\"0\",\"\"))","v":{"$error":"#VALUE!"}},{"$f":"IF(F22=\"\",\"\",IF(AND(F22>=('Data upload'!H50+(BD22*4)),F22<('Data upload'!H50+(BD22*5))),\"0\",\"\"))","v":{"$error":"#VALUE!"}},{"$f":"IF(F22=\"\",\"\",IF(AND(F22>=('Data upload'!H50+(BD22*5)),F22<('Data upload'!H50+(BD22*6))),\"0\",\"\"))","v":{"$error":"#VALUE!"}},{"$f":"IF(F22=\"\",\"\",IF(AND(F22>=('Data upload'!H50+(BD22*6)),F22<('Data upload'!H50+(BD22*7))),\"0\",\"\"))","v":{"$error":"#VALUE!"}},{"$f":"IF(F22=\"\",\"\",IF(AND(F22>=('Data upload'!H50+(BD22*7)),F22<('Data upload'!H50+(BD22*8))),\"0\",\"\"))","v":{"$error":"#VALUE!"}},{"$f":"IF(F22=\"\",\"\",IF(AND(F22>=('Data upload'!H50+(BD22*8)),F22<('Data upload'!H50+(BD22*9))),\"0\",\"\"))","v":{"$error":"#VALUE!"}},{"$f":"IF(F22=\"\",\"\",IF(AND(F22>=('Data upload'!H50+(BD22*9)),F22<(AZ22)),\"0\",\"\"))","v":{"$error":"#VALUE!"}},{"$f":"IF(OR(F22=\"Not evaluable ratio\",F22=\"Sector no válido, seleccione otro agregado de comparación\"),\"\",IF(F22>=AZ22,\"0\",\"\"))","v":{"$error":"#VALUE!"}},null,{"$f":"+'Data upload'!F50-('Data upload'!G50-'Data upload'!F50)","v":{"$error":"#VALUE!"}},{"$f":"+'Data upload'!H50+('Data upload'!H50-'Data upload'!G50)","v":{"$error":"#VALUE!"}},{"$f":"+('Data upload'!F50-Report!AY22)/10","v":{"$error":"#VALUE!"}},{"$f":"+('Data upload'!G50-'Data upload'!F50)/10","v":{"$error":"#VALUE!"}},{"$f":"+('Data upload'!H50-'Data upload'!G50)/10","v":{"$error":"#VALUE!"}},{"$f":"+(AZ22-'Data upload'!H50)/10","v":{"$error":"#VALUE!"}}]
[null,null,null,null,null,null,null,null,null,null,null,null,null,null,null,{"$f":"\"Q1 = \"&IF(COUNTBLANK('Data upload'!F44:H44)+COUNTIF('Data upload'!F44:H44,\"-\")+COUNTBLANK('Data upload'!F47:H47)+COUNTIF('Data upload'!F47:H47,\"-\")+COUNTBLANK('Data upload'!F50:H50)+COUNTIF('Data upload'!F50:H50,\"-\")>=1,\"ND\",'Data upload'!F50)","v":"Q1 = ND"},null,null,null,null,null,null,null,null,null,{"$f":"\"Q2 = \"&IF(COUNTBLANK('Data upload'!F44:H44)+COUNTIF('Data upload'!F44:H44,\"-\")+COUNTBLANK('Data upload'!F47:H47)+COUNTIF('Data upload'!F47:H47,\"-\")+COUNTBLANK('Data upload'!F50:H50)+COUNTIF('Data upload'!F50:H50,\"-\")>=1,\"ND\",'Data upload'!G50)","v":"Q2 = ND"},null,null,null,null,null,null,null,null,null,{"$f":"\"Q3 = \"&IF(COUNTBLANK('Data upload'!F44:H44)+COUNTIF('Data upload'!F44:H44,\"-\")+COUNTBLANK('Data upload'!F47:H47)+COUNTIF('Data upload'!F47:H47,\"-\")+COUNTBLANK('Data upload'!F50:H50)+COUNTIF('Data upload'!F50:H50,\"-\")>=1,\"ND\",'Data upload'!H50)","v":"Q3 = ND"}]
[null,null,null,null,null,null,null,{"$f":"IF(ISERROR(TEXT('Data upload'!K90-1,\"####\")),\"\",IF('Data upload'!K90=\"\",\"\",TEXT('Data upload'!K90-1,\"####\")))","v":""}]
[null,null,null,null,{"$f":"+'Data upload'!E12","v":"N-1"},{"$f":"IF(COUNTBLANK('Data upload'!F45:H45)+COUNTIF('Data upload'!F45:H45,\"-\")+COUNTBLANK('Data upload'!F48:H48)+COUNTIF('Data upload'!F48:H48,\"-\")+COUNTBLANK('Data upload'!F51:H51)+COUNTIF('Data upload'!F51:H51,\"-\")>=1,\"Sector not valid, select another comparative aggregate\",IF(OR('EBITDA calculation'!E46=\"\",ISERROR('EBITDA calculation'!E46)),\"Not evaluable ratio\",'EBITDA calculation'!E46))","v":"Sector not valid, select another comparative aggregate"},null,{"$f":"IF(F25<AY25,\"0\",\"\")","v":{"$error":"#VALUE!"}},{"$f":"IF(F25=\"\",\"\",IF(AND(F25>=AY25,F25<(AY25+BA25)),\"0\",\"\"))","v":{"$error":"#VALUE!"}},{"$f":"IF(F25=\"\",\"\",IF(AND(F25>=AY25+BA25,F25<(AY25+(BA25*2))),\"0\",\"\"))","v":{"$error":"#VALUE!"}},{"$f":"IF(F25=\"\",\"\",IF(AND(F25>=AY25+(BA25*2),F25<(AY25+(BA25*3))),\"0\",\"\"))","v":{"$error":"#VALUE!"}},{"$f":"IF(F25=\"\",\"\",IF(AND(F25>=AY25+(BA25*3),F25<(AY25+(BA25*4))),\"0\",\"\"))","v":{"$error":"#VALUE!"}},{"$f":"IF(F25=\"\",\"\",IF(AND(F25>=AY25+(BA25*4),F25<(AY25+(BA25*5))),\"0\",\"\"))","v":{"$error":"#VALUE!"}},{"$f":"IF(F25=\"\",\"\",IF(AND(F25>=AY25+(BA25*5),F25<(AY25+(BA25*6))),\"0\",\"\"))","v":{"$error":"#VALUE!"}},{"$f":"IF(F25=\"\",\"\",IF(AND(F25>=AY25+(BA25*6),F25<(AY25+(BA25*7))),\"0\",\"\"))","v":{"$error":"#VALUE!"}},{"$f":"IF(F25=\"\",\"\",IF(AND(F25>=AY25+(BA25*7),F25<(AY25+(BA25*8))),\"0\",\"\"))","v":{"$error":"#VALUE!"}},{"$f":"IF(F25=\"\",\"\",IF(AND(F25>=AY25+(BA25*8),F25<(AY25+(BA25*9))),\"0\",\"\"))","v":{"$error":"#VALUE!"}},{"$f":"IF(F25=\"\",\"\",IF(AND(F25>=AY25+(BA25*9),F25<('Data upload'!F51)),\"0\",\"\"))","v":{"$error":"#VALUE!"}},{"$f":"IF(F25=\"\",\"\",IF(AND(F25>='Data upload'!$F$51,F25<('Data upload'!$F$51+BB25)),\"0\",\"\"))","v":{"$error":"#VALUE!"}},{"$f":"IF(F25=\"\",\"\",IF(AND(F25>=('Data upload'!$F$51+BB25),F25<('Data upload'!$F$51+(BB25*2))),\"0\",\"\"))","v":{"$error":"#VALUE!"}},{"$f":"IF(F25=\"\",\"\",IF(AND(F25>=('Data upload'!$F$51+(BB25*2)),F25<('Data upload'!$F$51+(BB25*3))),\"0\",\"\"))","v":{"$error":"#VALUE!"}},{"$f":"IF(F25=\"\",\"\",IF(AND(F25>=('Data upload'!$F$51+(BB25*3)),F25<('Data upload'!$F$51+(BB25*4))),\"0\",\"\"))","v":{"$error":"#VALUE!"}},{"$f":"IF(F25=\"\",\"\",IF(AND(F25>=('Data upload'!$F$51+(BB25*4)),F25<('Data upload'!$F$51+(BB25*5))),\"0\",\"\"))","v":{"$error":"#VALUE!"}},{"$f":"IF(F25=\"\",\"\",IF(AND(F25>=('Data upload'!$F$51+(BB25*5)),F25<('Data upload'!$F$51+(BB25*6))),\"0\",\"\"))","v":{"$error":"#VALUE!"}},{"$f":"IF(F25=\"\",\"\",IF(AND(F25>=('Data upload'!$F$51+(BB25*6)),F25<('Data upload'!$F$51+(BB25*7))),\"0\",\"\"))","v":{"$error":"#VALUE!"}},{"$f":"IF(F25=\"\",\"\",IF(AND(F25>=('Data upload'!$F$51+(BB25*7)),F25<('Data upload'!$F$51+(BB25*8))),\"0\",\"\"))","v":{"$error":"#VALUE!"}},{"$f":"IF(F25=\"\",\"\",IF(AND(F25>=('Data upload'!$F$51+(BB25*8)),F25<('Data upload'!$F$51+(BB25*9))),\"0\",\"\"))","v":{"$error":"#VALUE!"}},{"$f":"IF(F25=\"\",\"\",IF(AND(F25>=('Data upload'!$F$51+(BB25*9)),F25<('Data upload'!$G$51)),\"0\",\"\"))","v":{"$error":"#VALUE!"}},{"$f":"IF(F25=\"\",\"\",IF(AND(F25>='Data upload'!$G$51,F25<('Data upload'!$G$51+BC25)),\"0\",\"\"))","v":{"$error":"#VALUE!"}},{"$f":"IF(F25=\"\",\"\",IF(AND(F25>=('Data upload'!$G$51+BC25),F25<('Data upload'!$G$51+(BC25*2))),\"0\",\"\"))","v":{"$error":"#VALUE!"}},{"$f":"IF(F25=\"\",\"\",IF(AND(F25>=('Data upload'!$G$51+(BC25*2)),F25<('Data upload'!$G$51+(BC25*3))),\"0\",\"\"))","v":{"$error":"#VALUE!"}},{"$f":"IF(F25=\"\",\"\",IF(AND(F25>=('Data upload'!$G$51+(BC25*3)),F25<('Data upload'!$G$51+(BC25*4))),\"0\",\"\"))","v":{"$error":"#VALUE!"}},{"$f":"IF(F25=\"\",\"\",IF(AND(F25>=('Data upload'!$G$51+(BC25*4)),F25<('Data upload'!$G$51+(BC25*5))),\"0\",\"\"))","v":{"$error":"#VALUE!"}},{"$f":"IF(F25=\"\",\"\",IF(AND(F25>=('Data upload'!$G$51+(BC25*5)),F25<('Data upload'!$G$51+(BC25*6))),\"0\",\"\"))","v":{"$error":"#VALUE!"}},{"$f":"IF(F25=\"\",\"\",IF(AND(F25>=('Data upload'!$G$51+(BC25*6)),F25<('Data upload'!$G$51+(BC25*7))),\"0\",\"\"))","v":{"$error":"#VALUE!"}},{"$f":"IF(F25=\"\",\"\",IF(AND(F25>=('Data upload'!$G$51+(BC25*7)),F25<('Data upload'!$G$51+(BC25*8))),\"0\",\"\"))","v":{"$error":"#VALUE!"}},{"$f":"IF(F25=\"\",\"\",IF(AND(F25>=('Data upload'!$G$51+(BC25*8)),F25<('Data upload'!$G$51+(BC25*9))),\"0\",\"\"))","v":{"$error":"#VALUE!"}},{"$f":"IF(F25=\"\",\"\",IF(AND(F25>=('Data upload'!$G$51+(BC25*9)),F25<('Data upload'!$H$51)),\"0\",\"\"))","v":{"$error":"#VALUE!"}},{"$f":"IF(F25=\"\",\"\",IF(AND(F25>='Data upload'!$H$51,F25<('Data upload'!$H$51+BD25)),\"0\",\"\"))","v":{"$error":"#VALUE!"}},{"$f":"IF(F25=\"\",\"\",IF(AND(F25>=('Data upload'!$H$51+BD25),F25<('Data upload'!$H$51+(BD25*2))),\"0\",\"\"))","v":{"$error":"#VALUE!"}},{"$f":"IF(F25=\"\",\"\",IF(AND(F25>=('Data upload'!$H$51+(BD25*2)),F25<('Data upload'!$H$51+(BD25*3))),\"0\",\"\"))","v":{"$error":"#VALUE!"}},{"$f":"IF(F25=\"\",\"\",IF(AND(F25>=('Data upload'!$H$51+(BD25*3)),F25<('Data upload'!$H$51+(BD25*4))),\"0\",\"\"))","v":{"$error":"#VALUE!"}},{"$f":"IF(F25=\"\",\"\",IF(AND(F25>=('Data upload'!$H$51+(BD25*4)),F25<('Data upload'!$H$51+(BD25*5))),\"0\",\"\"))","v":{"$error":"#VALUE!"}},{"$f":"IF(F25=\"\",\"\",IF(AND(F25>=('Data upload'!$H$51+(BD25*5)),F25<('Data upload'!$H$51+(BD25*6))),\"0\",\"\"))","v":{"$error":"#VALUE!"}},{"$f":"IF(F25=\"\",\"\",IF(AND(F25>=('Data upload'!$H$51+(BD25*6)),F25<('Data upload'!$H$51+(BD25*7))),\"0\",\"\"))","v":{"$error":"#VALUE!"}},{"$f":"IF(F25=\"\",\"\",IF(AND(F25>=('Data upload'!$H$51+(BD25*7)),F25<('Data upload'!$H$51+(BD25*8))),\"0\",\"\"))","v":{"$error":"#VALUE!"}},{"$f":"IF(F25=\"\",\"\",IF(AND(F25>=('Data upload'!$H$51+(BD25*8)),F25<('Data upload'!$H$51+(BD25*9))),\"0\",\"\"))","v":{"$error":"#VALUE!"}},{"$f":"IF(F25=\"\",\"\",IF(AND(F25>=('Data upload'!$H$51+(BD25*9)),F25<(AZ25)),\"0\",\"\"))","v":{"$error":"#VALUE!"}},{"$f":"IF(OR(F25=\"Not evaluable ratio\",F25=\"Sector no válido, seleccione otro agregado de comparación\"),\"\",IF(F25>=AZ25,\"0\",\"\"))","v":{"$error":"#VALUE!"}},null,{"$f":"+'Data upload'!F51-('Data upload'!G51-'Data upload'!F51)","v":{"$error":"#VALUE!"}},{"$f":"+'Data upload'!H51+('Data upload'!H51-'Data upload'!G51)","v":{"$error":"#VALUE!"}},{"$f":"+('Data upload'!F51-Report!AY25)/10","v":{"$error":"#VALUE!"}},{"$f":"+('Data upload'!G51-'Data upload'!F51)/10","v":{"$error":"#VALUE!"}},{"$f":"+('Data upload'!H51-'Data upload'!G51)/10","v":{"$error":"#VALUE!"}},{"$f":"+(AZ25-'Data upload'!H51)/10","v":{"$error":"#VALUE!"}}]
[null,null,null,null,null,null,null,null,null,null,null,null,null,null,null,{"$f":"\"Q1 = \"&IF(COUNTBLANK('Data upload'!F45:H45)+COUNTIF('Data upload'!F45:H45,\"-\")+COUNTBLANK('Data upload'!F48:H48)+COUNTIF('Data upload'!F48:H48,\"-\")+COUNTBLANK('Data upload'!F51:H51)+COUNTIF('Data upload'!F51:H51,\"-\")>=1,\"ND\",'Data upload'!F51)","v":"Q1 = ND"},null,null,null,null,null,null,null,null,null,{"$f":"\"Q2 = \"&IF(COUNTBLANK('Data upload'!F45:H45)+COUNTIF('Data upload'!F45:H45,\"-\")+COUNTBLANK('Data upload'!F48:H48)+COUNTIF('Data upload'!F48:H48,\"-\")+COUNTBLANK('Data upload'!F51:H51)+COUNTIF('Data upload'!F51:H51,\"-\")>=1,\"ND\",'Data upload'!G51)","v":"Q2 = ND"},null,null,null,null,null,null,null,null,null,{"$f":"\"Q3 = \"&IF(COUNTBLANK('Data upload'!F45:H45)+COUNTIF('Data upload'!F45:H45,\"-\")+COUNTBLANK('Data upload'!F48:H48)+COUNTIF('Data upload'!F48:H48,\"-\")+COUNTBLANK('Data upload'!F51:H51)+COUNTIF('Data upload'!F51:H51,\"-\")>=1,\"ND\",'Data upload'!H51)","v":"Q3 = ND"}]
[]
[]
[]
[null,null,null,null,null,null,null,null,null,null,null,null," "]
[]
[]
[]
[]
[null,{"$f":"IF('Data upload'!H6=1,\"\",\"* Firm data have been manually uploaded\")","v":""}]
[null,{"$f":"IF(OR('EBITDA calculation'!E35<>0,'EBITDA calculation'!F35<>0,'EBITDA calculation'!E36<>0,'EBITDA calculation'!F36<>0),\"* The firm has incorporated other complementary adjustments on non-recurring income or expenses, affecting to the EBITDA calculation.\",\"\")","v":""}]
[null,"NOTE: The sectoral information provided in this report has been obtained from the Spanish contribution to the BACH database. Banco de España (Central Balance Sheet Data Office) / Registries in Spain (Mercantile Registers - CPE) / European Committee of Central Balance Sheet Data Offices.\n\n"]
[null,"The variables analysed are not evaluated at firms with a zero or negative denominator , which affects both the statistical distributions and the firms from which this report is obtained. "]